Octanoic acid, 2-methyl-, ethyl ester

Van Den Dool and Kratz RI, polar column, temperature ramp

Data compiled by: NIST Mass Spectrometry Data Center, William E. Wallace, director

Column type Capillary
Active phase Supelcowax-10
Column length (m) 30.
Carrier gas He
Substrate
Column diameter (mm) 0.25
Phase thickness (μm) 0.25
Tstart (C) 60.
Tend (C) 240.
Heat rate (K/min) 3.
Initial hold (min) 5.
Final hold (min) 10.
I 1388.
ReferenceRiu-Aumatell, Lopez-Tamames, et al., 2005
Comment MSDC-RI

References

Riu-Aumatell, Lopez-Tamames, et al., 2005
Riu-Aumatell, M.; Lopez-Tamames, E.; Buxaderas, S., Assessment of the Volatile Composition of Juices of Apricot, Peach, and Pear According to Two Pectolytic Treatments, J. Agric. Food Chem., 2005, 53, 20, 7837-7843, https://doi.org/10.1021/jf051397z . [all data]