bis-(difluoromethoxy)difluoromethane

Phase change data

Data compiled by: William E. Acree, Jr., James S. Chickos

Enthalpy of vaporization

ΔvapH (kJ/mol) Temperature (K) Reference
31.5 ± 0.4243. - 308.Marchionni, Bassi, et al., 1999
36.8363.Shreeve and Sauer, 1971

Enthalpy of fusion

ΔfusH (kJ/mol) Temperature (K) Reference
7.2153.Marchionni, Bassi, et al., 1999

References

Marchionni, Bassi, et al., 1999
Marchionni, Giuseppe; Bassi, Mattia; Fontana, Giovanni; Maccone, Patrizia; Ajroldi, Giuseppe, Some physical chemical properties of α--ω dihydroperfluoropolyethers, Journal of Fluorine Chemistry, 1999, 98, 1, 41-54, https://doi.org/10.1016/S0022-1139(99)00085-8 . [all data]

Shreeve and Sauer, 1971
Shreeve, Jean'ne M.; Sauer, Dennis T., Chemistry of trifluoromethylsulfinyl fluoride. Trifluoromethylsulfinamides and trifluoromethylsulfinate esters, Inorg. Chem., 1971, 10, 2, 358-362, https://doi.org/10.1021/ic50096a028 . [all data]