Pregn-4-ene-3,20-dione, 17,21-[(methylborylene)bis(oxy)]-

Kovats' RI, non-polar column, isothermal

View large format table.

Column type Active phase Temperature (C) I Reference Comment
PackedOV-1250.2820.Baillie, Brooks, et al., 1972N2, Gas Chrom Q (100-120 mesh); Column length: 2. m

References

Baillie, Brooks, et al., 1972
Baillie, T.A.; Brooks, C.J.W.; Middleditch, B.S., Comparison of Corticosteroid Derivatives by Gas-Chromatography-Mass Spectrometry, Anal. Chem., 1972, 44, 1, 30-37, https://doi.org/10.1021/ac60309a016 . [all data]