Diisopropylcyanamide

Condensed phase thermochemistry data

Data compiled by: Hussein Y. Afeefy, Joel F. Liebman, and Stephen E. Stein

Quantity Value Units Method Reference Comment
Δfliquid-51.42kJ/molCcbSalley and Gray, 1951correction of Salley and Gray, 1948
Quantity Value Units Method Reference Comment
Δcliquid-4704.03kJ/molCcbSalley and Gray, 1951correction of Salley and Gray, 1948

Phase change data

Data compiled as indicated in comments:
BS - Robert L. Brown and Stephen E. Stein
TRC - Thermodynamics Research Center, NIST Boulder Laboratories, Chris Muzny director

Quantity Value Units Method Reference Comment
Tfus244.84KN/AWitschonke, 1954Uncertainty assigned by TRC = 0.6 K; TRC
Tfus245.85KN/AWitschonke, 1954Uncertainty assigned by TRC = 0.3 K; TRC

Reduced pressure boiling point

Tboil (K) Pressure (bar) Reference Comment
366.70.033Aldrich Chemical Company Inc., 1990BS

In addition to the Thermodynamics Research Center (TRC) data available from this site, much more physical and chemical property data is available from the following TRC products:

References

Salley and Gray, 1951
Salley, D.J.; Gray, J.B., Heats of combustion of some organic nitrogen compounds, J. Am. Chem. Soc., 1951, 73, 5925. [all data]

Salley and Gray, 1948
Salley, D.J.; Gray, J.B., Heats of combustion of some organic nitrogen compounds, J. Am. Chem. Soc., 1948, 70, 2650-2653. [all data]

Witschonke, 1954
Witschonke, C.R., Freezing point and purity data for some organic compounds, Anal. Chem., 1954, 26, 562-4. [all data]

Aldrich Chemical Company Inc., 1990
Aldrich Chemical Company Inc., Catalog Handbook of Fine Chemicals, Aldrich Chemical Company, Inc., Milwaukee WI, 1990, 1. [all data]