γ-Elemene

Normal alkane RI, non-polar column, temperature ramp

View large format table.

Column type Active phase I Reference Comment
CapillaryDB-51434.Rodriques, Amorim, et al., 201330. m/0.25 mm/0.25 μm, Helium, 3. K/min; Tstart: 60. C; Tend: 240. C
CapillaryHP-5 MS1425.Hammami, Kamoun, et al., 201130. m/0.25 mm/0.25 μm, Helium, 2. K/min; Tstart: 50. C; Tend: 180. C
CapillaryHP-51434.Kahriman, Tosun, et al., 201030. m/0.32 mm/0.25 μm, Helium, 60. C @ 2. min, 3. K/min; Tend: 240. C
CapillaryHP-5 MS1432.Radulovic, Dordevic, et al., 201030. m/0.25 mm/0.25 μm, Helium, 5. K/min, 290. C @ 10. min; Tstart: 70. C
CapillaryDB-5 MS1425.Silva, Pott, et al., 201030. m/0.25 mm/0.25 μm, Helium, 3. K/min; Tstart: 60. C; Tend: 240. C
CapillaryDB-51437.Ho, Wang, et al., 200930. m/0.25 mm/0.25 μm, Helium, 50. C @ 2. min, 5. K/min; Tend: 250. C
CapillaryDB-51451.Pripdeevech, Wongpornchai, et al., 200630. m/0.25 mm/0.25 μm, Hydrogen, 2. K/min; Tstart: 120. C; Tend: 180. C
CapillaryHP-51432.Velickovic, Ristic, et al., 200325. m/0.32 mm/0.53 μm, Helium, 4. K/min; Tstart: 40. C; Tend: 280. C
CapillaryHP-51437.Velickovic, Ristic, et al., 200325. m/0.32 mm/0.53 μm, Helium, 4. K/min; Tstart: 40. C; Tend: 280. C
CapillaryHP-5 MS1397.Shang, Hu, et al., 200130. m/0.25 mm/0.25 μm, Helium, 50. C @ 2. min, 5. K/min, 250. C @ 5. min

Normal alkane RI, non-polar column, custom temperature program

View large format table.

Column type Active phase I Reference Comment
CapillaryDB-51434.Rodriques, Amorim, et al., 201330. m/0.25 mm/0.25 μm, Helium; Program: not specified
CapillaryPolydimethyl siloxane with 5 % Ph groups1427.da Silva, de Souza, et al., 201230. m/0.25 mm/0.25 μm, Helium; Program: 50 0C 4 0C/min -> 200 0C (5 min) 20 0C/min -> 280 0C
CapillaryOV-11409.Chen and Li, 2011Helium; Column length: 30. m; Column diameter: 0.25 mm; Program: 40 0C 2 0C/min -> 120 0C 10 0C/min -> 230 0C (15 min)
CapillaryDB-51455.Miyazaki, Plotto, et al., 201160. m/0.25 mm/1.00 μm, Helium; Program: 40 0C 4 0C/min -> 230 0C 100 0C/min -> 260 0C (11.7 min)
CapillaryHP-51437.Kahriman, Tosun, et al., 201030. m/0.32 mm/0.25 μm, Helium; Program: not specified
CapillaryHP-5 MS1435.Sharifiar, Yassa, et al., 201030. m/0.25 mm/0.25 μm, Helium; Program: 50 0C (3 min) 3 0C/min -> 160 0C (10 min) 3 0C/min -> 240 0C
CapillaryHP-51430.Custer, 200925. m/0.32 mm/0.17 μm, Helium; Program: 60 0C (5 min) 4 0C/min -> 220 0C 11 0C/min -> 280 0C (15 min)
CapillaryHP-51431.Custer, 200925. m/0.32 mm/0.17 μm, Helium; Program: 60 0C (5 min) 4 0C/min -> 220 0C 11 0C/min -> 280 0C (15 min)
CapillaryHP-51432.Custer, 200925. m/0.32 mm/0.17 μm, Helium; Program: 60 0C (5 min) 4 0C/min -> 220 0C 11 0C/min -> 280 0C (15 min)
CapillaryHP-51436.Custer, 200925. m/0.32 mm/0.17 μm, Helium; Program: not specified
CapillaryHP-51436.Custer, 200925. m/0.32 mm/0.17 μm, Helium; Program: not specified
CapillaryHP-51436.Custer, 200925. m/0.32 mm/0.17 μm, Helium; Program: not specified
CapillaryDB-51433.Yang, Yang, et al., 200930. m/0.25 mm/0.25 μm, Helium; Program: 50 0C 95 min) 3 0C/min -> 100 0C 4 0C/min -> 160 0C 5 0C/min -> 220 0C (15 min)
CapillaryDB-51437.Nivinsliene, Butkiene, et al., 200750. m/0.32 mm/0.25 μm, Helium; Program: 60 0C (1 min) 5 0C/min -> 160 0C 10 0C/min -> 250 0C
CapillaryHP-5 MS1440.Kawaree, Phutdhawong, et al., 200630. m/0.25 mm/0.25 μm, HGelium; Program: 40 0C (3 min) 10 0C/min -> 108 0C 3 0C/min -> 188 0C 4 0C/min -> 280 0C (5 min)
CapillaryDB-51437.Pripdeevech, Wongpornchai, et al., 200630. m/0.25 mm/0.25 μm, Hydrogen; Program: not specified
CapillaryHP-5 MS1400.Shang, Hu, et al., 200130. m/0.25 mm/0.25 μm, Helium; Program: not specified

Normal alkane RI, polar column, temperature ramp

View large format table.

Column type Active phase I Reference Comment
CapillaryHP-Innowax1641.Feng, Cui, et al., 201160. m/0.25 mm/0.25 μm, Helium, 60. C @ 1. min, 5. K/min, 220. C @ 5. min

Normal alkane RI, polar column, custom temperature program

View large format table.

Column type Active phase I Reference Comment
CapillaryHP-Innowax1651.Feng, Cui, et al., 201160. m/0.25 mm/0.25 μm, Helium; Program: not specified
CapillaryInnowax1650.Noorizadeh, Farmany, et al., 201160. m/0.25 mm/0.33 μm; Program: not specified
CapillaryHP Innowax1650.Noorizadeh and Farmany, 201060. m/0.25 mm/0.33 μm; Program: not specified

References

Rodriques, Amorim, et al., 2013
Rodriques, K.A. da.F.; Amorim, L.V.; de Oliveira, J.M.G.; Dias, C.N.; Moraes, D.F.C.; Andrade, E.H. deA.; Maia, J.G.S.; Carneiro, S.M.P.; Carvalho, F.A. deA., Eugenia uniflora L. essential oil as a potential anti-Leishmania agent: effect on Leishmania amazonensis and possible mechanism of action, Evidence-Based Complementary and Alternative Medicine, 2013, 2013, 1-10, https://doi.org/10.1155/2013/279726 . [all data]

Hammami, Kamoun, et al., 2011
Hammami, I.; Kamoun, N.; Rebai, A., Biocontrol of Botrytis cinerea with essential oil and methanol extract of Viola odorata flowers, Archives of Appl. Sci. Res., 2011, 3, 5, 44-51. [all data]

Kahriman, Tosun, et al., 2010
Kahriman, N.; Tosun, G.; Genc, H.; Yayli, N., Comparative essential oil analysis of Geranium sylvaticum estracted by hydrodistillation and microwave distillation, Turk. J. Chem., 2010, 34, 969-976. [all data]

Radulovic, Dordevic, et al., 2010
Radulovic, N.; Dordevic, N.; Markovic, M.; Palic, R., Volatile constituents of Glechoma Hirsuta Waldst. Kit. and G. Hederacea L. (Lamiaceae), Bull. Chem. Soc. Ethiop., 2010, 24, 1, 67-76, https://doi.org/10.4314/bcse.v24i1.52962 . [all data]

Silva, Pott, et al., 2010
Silva, D.B.; Pott, A.; Oliveira, D.C.R., Analyses of the headspace volatile constituents of aerial parts (leaves and stems), flowers and fruits of Bidens gardneri Bak. and Bidens sulphurea (Cav.) Sch. Bip. using solid-phase microextraction, J. Essen. Oil Res., 2010, 22, 6, 560-563, https://doi.org/10.1080/10412905.2010.9700400 . [all data]

Ho, Wang, et al., 2009
Ho, C.-L.; Wang, E.I.-C.; Su, Y.-C., Essential oil compositions and bioactivities of the various parts of Cinnamomum camphora Sieb. var. linallolifera Fujuta, Journal title only in Chinese, 2009, 31, 2, 77-96. [all data]

Pripdeevech, Wongpornchai, et al., 2006
Pripdeevech, P.; Wongpornchai, S.; Promsiri, A., Highly Volatile Constituents of Vetiveria zizanioides Roots Grown under Different Cultivation Conditions, Molecules, 2006, 11, 10, 817-826, https://doi.org/10.3390/11100817 . [all data]

Velickovic, Ristic, et al., 2003
Velickovic, A.S.; Ristic, M.S.; Velickovic, D.T.; Ilic, S.; Mitic, N.D., The possibilities of the application of some species of sage (Salvia L.) as auxiliaries in the treatment of some diseases, J. Serb. Chem. Soc., 2003, 68, 6, 435-445, https://doi.org/10.2298/JSC0306435V . [all data]

Shang, Hu, et al., 2001
Shang, C.; Hu, Y.; Deng, C.; Hu, K., Rapid determination of volatile constituents of Michelia alba flowers by gas chromatography - mass spectrometry with solid-phase microextraction, J. Chromatogr. A, 2001, 942, 1-2, 283-288, https://doi.org/10.1016/S0021-9673(01)01382-6 . [all data]

da Silva, de Souza, et al., 2012
da Silva, A.C.; de Souza, P.E.; Machado, J. daC.; da Silva, B.M.; Pinto, J.E.B.P., Effectiveness of essential oils in the treatment of Colletotrichum truncatum-infected soybean seeds, Tropical Plant Patology, 2012, 37, 5, 305-313, https://doi.org/10.1590/S1982-56762012000500001 . [all data]

Chen and Li, 2011
Chen, S.; Li, X., Analysis of common volatile constituents between herbal pair Ephedra Sinica Stapf-Zingiber offoconale Rosc. and its single herb by GC-MS combined with AMWFA method, 2011, retrieved from http://www.webmedcentral.com. [all data]

Miyazaki, Plotto, et al., 2011
Miyazaki, T.; Plotto, A.; Goodner, K.; Gmitter F.G., Distribution of aroma volatile compounds in tangerine hybrids and proposed inheritance, J. Sci. Food Agric., 2011, 91, 3, 449-460, https://doi.org/10.1002/jsfa.4205 . [all data]

Sharifiar, Yassa, et al., 2010
Sharifiar, F.; Yassa, N.; Mozaffarian, V., Bioactivity of major components from the seeds of Bunium persicum (Boiss.) Fedtch, Pakistan J. Pharm. Sci., 2010, 23, 3, 300-304. [all data]

Custer, 2009
Custer, Y., GC Volatile Components Analysis of Different Parts of Litchi chinensis (Dissertation), 2009. [all data]

Yang, Yang, et al., 2009
Yang, Z.; Yang, W.; Peng, Q.; He, Q.; Feng, Y.; Luo, S.; Yu, Z., Volatile phytochemical composition of rhisome of ginger after extraction by headspace solid-phase microextraction, petrol ether extraction and steam distillation extraction, Bangladesh J. Pharmacol., 2009, 4, 2, 136-143, https://doi.org/10.3329/bjp.v4i2.3232 . [all data]

Nivinsliene, Butkiene, et al., 2007
Nivinsliene, O.; Butkiene, R.; Gudalevic, A.; Mockute, D.; Meskauskiene, V.; Grigaliunaite, B., Influence of urban environment on chemical composition of Tilia cordata essential oil, Chemija, 2007, 18, 1, 44-49. [all data]

Kawaree, Phutdhawong, et al., 2006
Kawaree, R.; Phutdhawong, W.; Picha, P.; Ngamkham, J., Chemical compounds, anticancer and antioxidant activities of volatile oil from Piper sarmentosum Roxb., Polyscias fruticosa Harms. and Polygonum odoratum Lour., KMITI Sci. J., 2006, 6, 2b, 499-504. [all data]

Feng, Cui, et al., 2011
Feng, T.; Cui, J.-J.; Xiao, Z.-B.; Tian, H.-X.; Yi, F.-P.; Ma, X., Chemical composition od essential oil from the peel of Chinese Torreya grandis Frt, Org. Chem. International, 2011, 2011, 1-5, https://doi.org/10.1155/2011/187372 . [all data]

Noorizadeh, Farmany, et al., 2011
Noorizadeh, H.; Farmany, A.; Noorizadeh, M., Quantitative structure-retention relationships analysis of retention index of essential oils, Quim. Nova, 2011, 34, 2, 242-249, https://doi.org/10.1590/S0100-40422011000200014 . [all data]

Noorizadeh and Farmany, 2010
Noorizadeh, H.; Farmany, A., Exploration of linear and nonlinear modeling techniques to predict of retention index of essential oils, J. Chin. Chem. Soc., 2010, 1268-1277. [all data]