Benzo(b)fluorene

Van Den Dool and Kratz RI, non-polar column, temperature ramp

Data compiled by: NIST Mass Spectrometry Data Center, William E. Wallace, director

Column type CapillaryCapillaryCapillaryCapillaryCapillary
Active phase SE-52SE-52SE-52SE-52SE-52
Column length (m) 33.316.616.616.616.6
Carrier gas HeHeHeHeHe
Substrate
Column diameter (mm) 0.500.500.500.500.50
Phase thickness (μm)
Tstart (C) 50.50.50.50.50.
Tend (C) 320.320.320.320.320.
Heat rate (K/min) 6.6.6.6.6.
Initial hold (min) 5.5.5.5.5.
Final hold (min)
I 2178.2161.2175.2176.2176.
ReferenceBeernaert, 1979Beernaert, 1979Beernaert, 1979Beernaert, 1979Beernaert, 1979
Comment MSDC-RI MSDC-RI MSDC-RI MSDC-RI MSDC-RI
Column type CapillaryCapillaryCapillaryCapillaryCapillary
Active phase SE-52SE-52SE-52SE-52SE-52
Column length (m) 16.616.616.616.616.6
Carrier gas HeHeHeHeHe
Substrate
Column diameter (mm) 0.500.500.500.500.50
Phase thickness (μm)
Tstart (C) 50.50.50.50.50.
Tend (C) 320.320.320.320.320.
Heat rate (K/min) 6.6.6.6.6.
Initial hold (min) 5.5.5.5.5.
Final hold (min)
I 2176.2176.2190.2190.2190.
ReferenceBeernaert, 1979Beernaert, 1979Beernaert, 1979Beernaert, 1979Beernaert, 1979
Comment MSDC-RI MSDC-RI MSDC-RI MSDC-RI MSDC-RI
Column type CapillaryCapillaryCapillaryCapillaryCapillary
Active phase SE-52SE-52SE-52SE-52SE-52
Column length (m) 16.616.616.616.616.6
Carrier gas HeHeHeHeHe
Substrate
Column diameter (mm) 0.500.500.500.500.50
Phase thickness (μm)
Tstart (C) 50.50.50.50.50.
Tend (C) 320.320.320.320.320.
Heat rate (K/min) 6.6.6.6.6.
Initial hold (min) 5.5.5.5.5.
Final hold (min)
I 2190.2200.2200.2200.2206.
ReferenceBeernaert, 1979Beernaert, 1979Beernaert, 1979Beernaert, 1979Beernaert, 1979
Comment MSDC-RI MSDC-RI MSDC-RI MSDC-RI MSDC-RI
Column type CapillaryCapillaryCapillary
Active phase SE-52SE-52SE-52
Column length (m) 16.616.665.
Carrier gas HeHeN2
Substrate
Column diameter (mm) 0.500.500.3
Phase thickness (μm)
Tstart (C) 50.50.100.
Tend (C) 320.320.300.
Heat rate (K/min) 6.6.1.8
Initial hold (min) 5.5.
Final hold (min)
I 2207.2212.2195.
ReferenceBeernaert, 1979Beernaert, 1979Carugno and Rossi, 1967
Comment MSDC-RI MSDC-RI MSDC-RI

Normal alkane RI, non-polar column, custom temperature program

Data compiled by: NIST Mass Spectrometry Data Center, William E. Wallace, director

Column type Capillary
Active phase Methyl Silicone
Column length (m) 25.
Carrier gas He
Substrate
Column diameter (mm) 0.25
Phase thickness (μm) 0.25
Program 50 0C (2 min) 20 0C/min -> 160 0C 5 0C/min -> 210 0C 10 0C/min -> 300 0C
I 2172.
ReferenceOda, Yasuhara, et al., 1998
Comment MSDC-RI

References

Beernaert, 1979
Beernaert, H., Gas Chromatographic Analysis of Polyclylic Aromatic Hydrocarbons, J. Chromatogr., 1979, 173, 1, 109-118, https://doi.org/10.1016/S0021-9673(01)80450-7 . [all data]

Carugno and Rossi, 1967
Carugno, N.; Rossi, S., Evaluation of polynuclear hydrocarbons in cigarette smoke by glass capillary columns, J. Gas Chromatogr., 1967, 5, 2, 103-106, https://doi.org/10.1093/chromsci/5.2.103 . [all data]