Butyl caprate

Normal alkane RI, non-polar column, temperature ramp

Data compiled by: NIST Mass Spectrometry Data Center, William E. Wallace, director

Column type CapillaryCapillaryCapillary
Active phase HP-5 MSSPB-5Ultra-1
Column length (m) 30.30.25.
Carrier gas HeliumHeHe
Substrate
Column diameter (mm) 0.320.320.32
Phase thickness (μm) 0.250.250.25
Tstart (C) 50.40.80.
Tend (C) 240.220.260.
Heat rate (K/min) 4.5.3.
Initial hold (min) 2.1.
Final hold (min) 10.20.
I 1599.1548.1568.
ReferencePino, Marquez, et al., 2010Ledauphin, Guichard, et al., 2003Okumura, 1991
Comment MSDC-RI MSDC-RI MSDC-RI

Van Den Dool and Kratz RI, non-polar column, temperature ramp

Data compiled by: NIST Mass Spectrometry Data Center, William E. Wallace, director

Column type Capillary
Active phase HP-5MS
Column length (m) 30.
Carrier gas He
Substrate
Column diameter (mm) 0.25
Phase thickness (μm) 0.25
Tstart (C) 60.
Tend (C) 250.
Heat rate (K/min) 4.
Initial hold (min) 2.
Final hold (min) 20.
I 1588.
ReferencePino, Mesa, et al., 2005
Comment MSDC-RI

Normal alkane RI, polar column, custom temperature program

Data compiled by: NIST Mass Spectrometry Data Center, William E. Wallace, director

Column type Capillary
Active phase Carbowax 20M
Column length (m)
Carrier gas
Substrate
Column diameter (mm)
Phase thickness (μm)
Program not specified
I 1798.
ReferenceVinogradov, 2004
Comment MSDC-RI

Kovats' RI, non-polar column, isothermal

View large format table.

Column type Active phase Temperature (C) I Reference Comment
CapillaryOV-101200.1569.Komárek, Hornová, et al., 1983Column length: 15. m; Column diameter: 0.22 mm

Kovats' RI, non-polar column, temperature ramp

View large format table.

Column type Active phase I Reference Comment
CapillaryDB-11570.Takeoka, Flath, et al., 199060. m/0.32 mm/0.25 μm, He, 30. C @ 4. min, 2. K/min; Tend: 210. C
CapillaryDB-11571.Takeoka, Flath, et al., 199060. m/0.32 mm/0.25 μm, He, 30. C @ 4. min, 2. K/min; Tend: 210. C
CapillaryOV-1011575.Morales and Duque, 1987He, 2. K/min; Column length: 25. m; Column diameter: 0.31 mm; Tstart: 60. C; Tend: 200. C

Van Den Dool and Kratz RI, polar column, temperature ramp

View large format table.

Column type Active phase I Reference Comment
CapillaryZB-Wax1812.Ledauphin, Saint-Clair, et al., 200430. m/0.25 mm/0.15 μm, He, 35. C @ 5. min, 5. K/min, 220. C @ 10. min

Normal alkane RI, non-polar column, custom temperature program

View large format table.

Column type Active phase I Reference Comment
CapillaryHP-5 MS1590.Pino, Marquez, et al., 201030. m/0.32 mm/0.25 μm, Helium; Program: not specified
CapillarySE-301575.Vinogradov, 2004Program: not specified
CapillaryOV-1011575.Morales and Duque, 1987He; Column length: 25. m; Column diameter: 0.31 mm; Program: not specified

Normal alkane RI, polar column, temperature ramp

View large format table.

Column type Active phase I Reference Comment
CapillarySupelcowax-101821.Ha and Lindsay, 198960. m/0.32 mm/0.25 μm, He, 50. C @ 15. min, 2. K/min; Tend: 230. C

References

Pino, Marquez, et al., 2010
Pino, J.A.; Marquez, E.; Quijano, C.E.; Castro, D., Volatile compounds in noni (Morinda citrifolia L.) at two ripening stages, Ciencia e Technologia de Alimentos, 2010, 30, 1, 183-187, https://doi.org/10.1590/S0101-20612010000100028 . [all data]

Ledauphin, Guichard, et al., 2003
Ledauphin, J.; Guichard, H.; Saint-Clair, J.-F.; Picoche, B.; Barillier, D., Chemical and sensorial aroma characterization of freshly distilled calvados. 2. Identification of volatile compounds and key odorants, J. Agric. Food Chem., 2003, 51, 2, 433-442, https://doi.org/10.1021/jf020373e . [all data]

Okumura, 1991
Okumura, T., retention indices of environmental chemicals on methyl silicone capillary column, Journal of Environmental Chemistry (Japan), 1991, 1, 2, 333-358, https://doi.org/10.5985/jec.1.333 . [all data]