Hydrogen fluoride dimer

Gas phase thermochemistry data

Quantity Value Units Method Reference Comment
Δfgas-572.66kJ/molReviewChase, 1998Data last reviewed in June, 1977
Quantity Value Units Method Reference Comment
gas,1 bar238.84J/mol*KReviewChase, 1998Data last reviewed in June, 1977

Gas Phase Heat Capacity (Shomate Equation)

Cp° = A + B*t + C*t2 + D*t3 + E/t2
H° − H°298.15= A*t + B*t2/2 + C*t3/3 + D*t4/4 − E/t + F − H
S° = A*ln(t) + B*t + C*t2/2 + D*t3/3 − E/(2*t2) + G
    Cp = heat capacity (J/mol*K)
    H° = standard enthalpy (kJ/mol)
    S° = standard entropy (J/mol*K)
    t = temperature (K) / 1000.

View plot Requires a JavaScript / HTML 5 canvas capable browser.

View table.

Temperature (K) 298. - 1500.1500. - 6000.
A 35.5891068.32974
B 50.552346.950001
C -28.01142-1.229352
D 6.7084580.076663
E -0.313996-12.36493
F -586.3416-616.1693
G 266.2555293.0398
H -572.6641-572.6641
ReferenceChase, 1998Chase, 1998
Comment Data last reviewed in June, 1977 Data last reviewed in June, 1977

Gas phase ion energetics data

Data compiled by: Sharon G. Lias, Rhoda D. Levin, and Sherif A. Kafafi

Appearance energy determinations

Ion AE (eV) Other Products MethodReferenceComment
H2F+15.65 ± 0.04FPITiedemann, Anderson, et al., 1979
H2F+15.65 ± 0.06FPINg, Trevor, et al., 1977

References

Chase, 1998
Chase, M.W., Jr., NIST-JANAF Themochemical Tables, Fourth Edition, J. Phys. Chem. Ref. Data, Monograph 9, 1998, 1-1951. [all data]

Tiedemann, Anderson, et al., 1979
Tiedemann, P.W.; Anderson, S.L.; Ceyer, S.T.; Hirooka, T.; Ng, C.Y.; Mahan, B.H.; Lee, Y.T., Proton affinities of hydrogen halides determined by the molecular beam photoionization method, J. Chem. Phys., 1979, 71, 605. [all data]

Ng, Trevor, et al., 1977
Ng, C.Y.; Trevor, D.J.; Tiedemann, P.W.; Ceyer, S.T.; Kronebusch, P.L.; Mahan, B.H.; Lee, Y.T., Photoionization of dimeric polyatomic molecules: proton affinities of H2O and HF, J. Chem. Phys., 1977, 67, 4235. [all data]