1,3,5-Benzenetriamine, 2,4,6-trinitro-

Condensed phase thermochemistry data

Data compiled by: Hussein Y. Afeefy, Joel F. Liebman, and Stephen E. Stein

Quantity Value Units Method Reference Comment
Δfsolid-74.7 ± 3.0kJ/molCcbBaroody and Peters, 1987
Δfsolid-140. ± 5.0kJ/molCcbRouse, 1976
Δfsolid-154.kJ/molCcbFedoroff and Shefield, 1975
Quantity Value Units Method Reference Comment
Δcsolid-3079. ± 2.kJ/molCcbRouse, 1976

Phase change data

Data compiled by: William E. Acree, Jr., James S. Chickos

Enthalpy of sublimation

ΔsubH (kJ/mol) Temperature (K) Method Reference Comment
168.423.N/ARai, Bhatt, et al., 2008See also Garza, 1979.
168.2417.LEStephenson and Malanowski, 1987Based on data from 402. - 451. K. See also Rosen and Dickinson, 1969.

References

Baroody and Peters, 1987
Baroody, E.E.; Peters, S.T., Heats of formation of propellant compounds (U), Rpt. IHSP-87-252 by Naval Ordnance Station, Indian Head, MD, 1987, 1-7. [all data]

Rouse, 1976
Rouse, P.E., Jr., Enthalpies of formation and calculated detonation properties of some thermally stable explosives, J. Chem. Eng. Data, 1976, 21, 16-20. [all data]

Fedoroff and Shefield, 1975
Fedoroff, B.T.; Shefield, O.E., Table 1. Standard heats of formation and heats of detonation of common explosives in Encyclopedia of Explosives and Related Items, Part 2700 Volume 7, Picatinny Arsenal, Dover, NJ., 1975, 41-42. [all data]

Rai, Bhatt, et al., 2008
Rai, Neeraj; Bhatt, Divesh; Siepmann, J. Ilja; Fried, Laurence E., Monte Carlo simulations of 1,3,5-triamino-2,4,6-trinitrobenzene (TATB): Pressure and temperature effects for the solid phase and vapor-liquid phase equilibria, J. Chem. Phys., 2008, 129, 19, 194510, https://doi.org/10.1063/1.3006054 . [all data]

Garza, 1979
Garza, R.G., A thermogravimetric study of TATB and two TATB-based explosives, Rpt. UCRL-82723, Lawrence Livermore National Laboratory, Livermore, CA, 1979, 1. [all data]

Stephenson and Malanowski, 1987
Stephenson, Richard M.; Malanowski, Stanislaw, Handbook of the Thermodynamics of Organic Compounds, 1987, https://doi.org/10.1007/978-94-009-3173-2 . [all data]

Rosen and Dickinson, 1969
Rosen, Jerome M.; Dickinson, Charles, Vapor pressures and heats of sublimation of some high-melting organic explosives, J. Chem. Eng. Data, 1969, 14, 1, 120-124, https://doi.org/10.1021/je60040a044 . [all data]