Diamantan-3-ol

Gas phase thermochemistry data

Data compiled by: Hussein Y. Afeefy, Joel F. Liebman, and Stephen E. Stein

Quantity Value Units Method Reference Comment
Δfgas-297.6 ± 4.6kJ/molCcbClark, Knox, et al., 1980

Condensed phase thermochemistry data

Data compiled by: Hussein Y. Afeefy, Joel F. Liebman, and Stephen E. Stein

Quantity Value Units Method Reference Comment
Δfsolid-413.8 ± 1.5kJ/molCcbClark, Knox, et al., 1980
Quantity Value Units Method Reference Comment
Δcsolid-7953.7 ± 1.5kJ/molCcbClark, Knox, et al., 1980Corresponding Δfsolid = -413.8 kJ/mol (simple calculation by NIST; no Washburn corrections)

References

Clark, Knox, et al., 1980
Clark, T.; Knox, T.M.; McKervey, M.A.; Mackle, H., Thermochemistry of bridged-ring substances. Enthalpies of formation of diamantan-1-, -3-, and -4-ol and of diamantanone, J. Chem. Soc. Perkin Trans. 2, 1980, 1686-1689. [all data]