Murexide

Condensed phase thermochemistry data

Data compiled by: Eugene S. Domalski and Elizabeth D. Hearing

Constant pressure heat capacity of solid

Cp,solid (J/mol*K) Temperature (K) Reference Comment
600.300.Abdel-Kader, Tahoon, et al., 1993T = 300 to 550 K. Data given graphically only. Cp value estimated from graph.

References

Abdel-Kader, Tahoon, et al., 1993
Abdel-Kader, M.M.; Tahoon, K.K.; El-Sharkawy, A., Thermophysical properties of ammonium purpurate (murexide) C8H4O6N5NH4, Phys. Status Solidi, 1993, A 135, 161-168. [all data]