Phenazine, 5-oxide

Gas phase thermochemistry data

Data compiled by: Hussein Y. Afeefy, Joel F. Liebman, and Stephen E. Stein

Quantity Value Units Method Reference Comment
Δfgas297.3 ± 4.8kJ/molCcbLeitao, Pilcher, et al., 1990

Condensed phase thermochemistry data

Data compiled by: Hussein Y. Afeefy, Joel F. Liebman, and Stephen E. Stein

Quantity Value Units Method Reference Comment
Δfsolid197.3 ± 4.6kJ/molCcbLeitao, Pilcher, et al., 1990
Quantity Value Units Method Reference Comment
Δcsolid-6062.7 ± 4.5kJ/molCcbLeitao, Pilcher, et al., 1990

Phase change data

Data compiled as indicated in comments:
ALS - Hussein Y. Afeefy, Joel F. Liebman, and Stephen E. Stein
AC - William E. Acree, Jr., James S. Chickos

Quantity Value Units Method Reference Comment
Δsub100.0 ± 1.3kJ/molCLeitao, Pilcher, et al., 1990ALS
Δsub100. ± 1.3kJ/molCLeitao, Pilcher, et al., 1990AC

Gas phase ion energetics data

Data compiled by: Sharon G. Lias, Rhoda D. Levin, and Sherif A. Kafafi

Ionization energy determinations

IE (eV) Method Reference Comment
8.10PEAlbini and Mark, 1976Vertical value
8.00 ± 0.02PEMaier, Muller, et al., 1975Vertical value

References

Leitao, Pilcher, et al., 1990
Leitao, M.L.; Pilcher, G.; Acree, W.E., Jr.; Zvaigzne, A.I.; Tucker, S.A.; Ribeiro Da Silva, M.D.M.C., Enthalpies of combustion of phenazine N-oxide, phenazine, benzofuroxan, and benzofurazan: the dissociation entrhalpies of the (N-O) bonds, J. Chem. Thermodyn., 1990, 22, 923-928. [all data]