1,4-Dimethyl-2-propylbenzene

Normal alkane RI, polar column, custom temperature program

Data compiled by: NIST Mass Spectrometry Data Center, William E. Wallace, director

Column type CapillaryCapillaryCapillary
Active phase Carbowax 20MCarbowax 20MPEG-20M
Column length (m)
Carrier gas
Substrate
Column diameter (mm)
Phase thickness (μm)
Program not specifiednot specifiednot specified
I 1415.1386.1415.
ReferenceCornwell and Cordano, 2003Ivanciuc, Ivanciuc, et al., 2001Xiuhua, Zhang, et al., 1996
Comment MSDC-RI MSDC-RI MSDC-RI

Kovats' RI, polar column, isothermal

Data compiled by: NIST Mass Spectrometry Data Center, William E. Wallace, director

Column type CapillaryCapillary
Active phase PEG-20MCarbowax 20M
Column length (m) 30.100.
Carrier gas N2
Substrate
Column diameter (mm) 0.30.2
Phase thickness (μm)
Temperature (C) 70.90.
I 1415.01385.9
ReferenceTóth, 1983Döring, Estel, et al., 1974
Comment MSDC-RI MSDC-RI

Normal alkane RI, non-polar column, temperature ramp

Data compiled by: NIST Mass Spectrometry Data Center, William E. Wallace, director

Column type Capillary
Active phase OV-1
Column length (m)
Carrier gas
Substrate
Column diameter (mm)
Phase thickness (μm)
Tstart (C) 50.
Tend (C) 160.
Heat rate (K/min) 2.
Initial hold (min)
Final hold (min)
I 1148.
ReferenceOrav, Kailas, et al., 1999
Comment MSDC-RI

References

Cornwell and Cordano, 2003
Cornwell, E.; Cordano, G., Nueva proposicion para predecir datos de retencion obtenidos mediante cromatografia de gases de hidrocarburos derivados de las naftas, Revista de la Sociedad Quimica de Mexico, 2003, 47, 1, 38-43. [all data]

Ivanciuc, Ivanciuc, et al., 2001
Ivanciuc, O.; Ivanciuc, T.; Klein, D.J.; Seitz, W.A.; Balaban, A.T., Quantitative structure-retention relationships for gas chromatographic retention indices of alkylbenzenes with molecular graph descriptors, SAR QSAR Environ. Res., 2001, 11, 5-6, 419-452, https://doi.org/10.1080/10629360108035362 . [all data]

Xiuhua, Zhang, et al., 1996
Xiuhua, Zh.; Zhang, L.; Che, X., Prediction of the Kovats retention indexes of polysubstituted alkylbenzenes, Chin. J. Chromatogr., 1996, 14, 4, 244-248. [all data]