P-dioxan-2-one

Phase change data

Data compiled by: William E. Acree, Jr., James S. Chickos

Enthalpy of fusion

ΔfusH (kJ/mol) Temperature (K) Reference
16.14301.7Lebedev, Bykova, et al., 1995

References

Lebedev, Bykova, et al., 1995
Lebedev, B.V.; Bykova, T.A.; Kiparisova, E.G.; Belen'kaya, B.G.; Filatova, V.N., Thermodynamics of p-dioxanone, polymerization reaction, and poly-p-dioxanone at 0 - 450 K, Vysokomol. Soed. A, 1995, 37, 2, 187. [all data]