2,4-Undecadienal, (E,E)-

Van Den Dool and Kratz RI, non-polar column, custom temperature program

Data compiled by: NIST Mass Spectrometry Data Center, William E. Wallace, director

Column type Capillary
Active phase SE-54
Column length (m) 30.
Carrier gas He
Substrate
Column diameter (mm) 0.32
Phase thickness (μm) 0.25
Program 20C => 70C/min => 50C => 4C/min => 180C => 10C/min => 240C(10min)
I 1445.
ReferenceBlank, Lin, et al., 2001
Comment MSDC-RI

References

Blank, Lin, et al., 2001
Blank, I.; Lin, J.; Arce Vera, F.; Welti, D.H.; Fay, L.B., Identification of potent odorants formed by autoxidation of arachidonic acid: structure elucidation and synthesis of (E,Z,Z)-2,4,7-tridecatrienal, J. Agric. Food Chem., 2001, 49, 6, 2959-2965, https://doi.org/10.1021/jf010160+ . [all data]