1H-Imidazole, 4-nitro-

Reaction thermochemistry data

Data compiled by: Hussein Y. Afeefy, Joel F. Liebman, and Stephen E. Stein

Individual Reactions

1H-Imidazole, 4-nitro- = 1H-Imidazole, 4-nitro-

By formula: C3H3N3O2 = C3H3N3O2

Quantity Value Units Method Reference Comment
Δr0.0kcal/molCisoJimenez, Laynez, et al., 1989gas phase; Tautomerism

References

Jimenez, Laynez, et al., 1989
Jimenez, P.; Laynez, J.; Claramunt, R.M.; Sanz, D.; Fayet, J.P.; Vertut, M.C.; Catalan, J.; Paz, J.L.G. de; Pfister-Guillouzo, G.; Guimon, C.; Flammang, R.; Maquestiau, A.; Elguero, J., The problem of the tautomerism of 4(5)-nitroimidazole: a theoretical and experimental study, New J. Chem., 1989, 13, 151-156. [all data]