C9H5N

Reaction thermochemistry data

Data compiled by: John E. Bartmess

Individual Reactions

C9H4N- + Hydrogen cation = C9H5N

By formula: C9H4N- + H+ = C9H5N

Quantity Value Units Method Reference Comment
Δr1471. ± 8.8kJ/molG+TSTaft, 1987gas phase; value altered from reference due to change in acidity scale
Quantity Value Units Method Reference Comment
Δr1438. ± 8.4kJ/molIMRETaft, 1987gas phase; value altered from reference due to change in acidity scale

References

Taft, 1987
Taft, R.W., The Nature and Analysis of Substitutent Electronic Effects, Personal communication. See also Prog. Phys. Org. Chem., 1987, 16, 1. [all data]