Naphthalene, 1,2,3,4-tetramethyl-

Kovats' RI, non-polar column, isothermal

View large format table.

Column type Active phase Temperature (C) I Reference Comment
CapillaryApiezon L200.1769.Klemm, Shabtai, et al., 1981

Lee's RI, non-polar column, temperature ramp

View large format table.

Column type Active phase I Reference Comment
CapillaryDB-5300.05Forster, Alexander, et al., 1989H2, 2. K/min, 300. C @ 10. min; Column length: 60. m; Column diameter: 0.20 mm; Tstart: 70. C

References

Klemm, Shabtai, et al., 1981
Klemm, L.H.; Shabtai, J.; Bodily, K.C., Gas chromatography of some C13-C16 alkylnaphthalenes on Bentone 34, silicone fluid DC 550 and Apiezon L phases, J. Chromatogr., 1981, 206, 2, 372-375, https://doi.org/10.1016/S0021-9673(00)82549-2 . [all data]

Forster, Alexander, et al., 1989
Forster, P.G.; Alexander, R.; Kagi, R.I., Identification and analysis of tetramethylnaphthalenes in petroleum, J. Chromatogr., 1989, 483, 384-389, https://doi.org/10.1016/S0021-9673(01)93138-3 . [all data]