Benzoic acid, 2,6-dihydroxy-

Normal alkane RI, non-polar column, isothermal

Data compiled by: NIST Mass Spectrometry Data Center, William E. Wallace, director

Column type Packed
Active phase Apieson L
Column length (m) 1.8
Carrier gas Nitrogen
Substrate Chromosorb W HMDS (60-80 mesh)
Column diameter (mm)
Phase thickness (μm)
Temperature (C) 140.
I 1397.
ReferenceHedin, Minyard, et al., 1967
Comment MSDC-RI

References

Hedin, Minyard, et al., 1967
Hedin, P.A.; Minyard, J.P.; Thompson, A.C., Chromatographic and spectral analysis of phenolic acids and related compounds, J. Chromatogr., 1967, 30, 43-53, https://doi.org/10.1016/S0021-9673(00)84111-4 . [all data]