1-(3-methylbutyl)naphthalene

Phase change data

Data compiled by: Thermodynamics Research Center, NIST Boulder Laboratories, Chris Muzny director

Quantity Value Units Method Reference Comment
Tboil561.KN/ALarsen, Thorpe, et al., 1942Uncertainty assigned by TRC = 4. K

In addition to the Thermodynamics Research Center (TRC) data available from this site, much more physical and chemical property data is available from the following TRC products:

References

Larsen, Thorpe, et al., 1942
Larsen, R.G.; Thorpe, R.E.; Armfield, F.A., Oxidation Characteristics of Pure Hydrocarbons, Ind. Eng. Chem., 1942, 34, 183. [all data]