6,13-Pentacenedione

Condensed phase thermochemistry data

Data compiled by: Hussein Y. Afeefy, Joel F. Liebman, and Stephen E. Stein

Quantity Value Units Method Reference Comment
Δcsolid-10299.3 ± 6.3kJ/molCcbMagnus, 1956Reanalyzed by Cox and Pilcher, 1970, Original value = -10298.66 kJ/mol; Corresponding Δfsolid = -72.89 kJ/mol (simple calculation by NIST; no Washburn corrections)

Phase change data

Data compiled as indicated in comments:
ALS - Hussein Y. Afeefy, Joel F. Liebman, and Stephen E. Stein
AC - William E. Acree, Jr., James S. Chickos

Quantity Value Units Method Reference Comment
Δsub116.kJ/molCMagnus, 1956ALS
Δsub116.3 ± 5.9kJ/molN/AMagnus, 1956See also Cox and Pilcher, 1970, 2.; AC

Gas phase ion energetics data

Data compiled as indicated in comments:
LLK - Sharon G. Lias, Rhoda D. Levin, and Sherif A. Kafafi

Ionization energy determinations

IE (eV) Method Reference Comment
8.07 ± 0.05PIPotapov and Sorokin, 1971LLK

References

Magnus, 1956
Magnus, A., Die resonanzenergien der parachinone Aui grund der prazisionsmessungsen ihrer verbrennungswarmen durch herrn gerhard wittwer, Z. Phys. Chem. (Neue Folge), 1956, 9, 141-161. [all data]

Cox and Pilcher, 1970
Cox, J.D.; Pilcher, G., Thermochemistry of Organic and Organometallic Compounds, Academic Press, New York, 1970, 1-636. [all data]

Cox and Pilcher, 1970, 2
Cox, J.D.; Pilcher, G., Thermochemistry of Organic and Organometallic Compounds, Academic Press Inc., London, 1970, 643. [all data]

Potapov and Sorokin, 1971
Potapov, V.K.; Sorokin, V.V., Photoionization and ion-molecule reactions in quinones and alcohols, High Energy Chem., 1971, 5, 435, In original 487. [all data]

Hartmann and Lorenz, 1952
Hartmann, H.; Lorenz, E., Z. Naturforsh, 1952, 7a, 360. [all data]