ethyl-2,4- trans, cisdecadienoate

Van Den Dool and Kratz RI, non-polar column, custom temperature program

Data compiled by: NIST Mass Spectrometry Data Center, William E. Wallace, director

Column type Capillary
Active phase VF-5MS
Column length (m) 30.
Carrier gas He
Substrate
Column diameter (mm) 0.25
Phase thickness (μm) 0.25
Program 40C(2min) => 5C/min => 200C (2min) => 30C/min => 260C
I 1553.
ReferenceCarasek and Pawliszyn, 2006
Comment MSDC-RI

References

Carasek and Pawliszyn, 2006
Carasek, E.; Pawliszyn, J., Screening of Tropical Fruit Volatile Compounds Using Solid-Phase Microextraction (SPME) Fibers and Internally Cooled SPME Fiber, J. Agric. Food Chem., 2006, 54, 23, 8688-8696, https://doi.org/10.1021/jf0613942 . [all data]