Perfluoro-2,7-dimethyloctane

Gas phase thermochemistry data

Data compiled by: Hussein Y. Afeefy, Joel F. Liebman, and Stephen E. Stein

Quantity Value Units Method Reference Comment
Δfgas-1108.8 ± 2.1kcal/molCcrZhogina, Papina, et al., 1989

Phase change data

Data compiled by: Hussein Y. Afeefy, Joel F. Liebman, and Stephen E. Stein

Quantity Value Units Method Reference Comment
Δvap11.7 ± 0.26kcal/molEZhogina, Papina, et al., 1989

References

Zhogina, Papina, et al., 1989
Zhogina, E.V.; Papina, T.S.; Kolesov, V.P.; Kosareva, L.N.; Ivanova, T.Ya., Enthalpy of formation of perfluoro-2,7-dimethyloctane, Thermochim. Acta, 1989, 139, 43-47. [all data]