Hydrogen cyanide-d1

Phase change data

Data compiled by: William E. Acree, Jr., James S. Chickos

Enthalpy of vaporization

ΔvapH (kcal/mol) Temperature (K) Reference Comment
6.26267.Stull, 1947Based on data from 182. - 282. K.
6.60279.Lewis and Schutz, 1934Based on data from 265. - 293. K.

Gas phase ion energetics data

Data compiled as indicated in comments:
LLK - Sharon G. Lias, Rhoda D. Levin, and Sherif A. Kafafi
RDSH - Henry M. Rosenstock, Keith Draxl, Bruce W. Steiner, and John T. Herron

Ionization energy determinations

IE (eV) Method Reference Comment
13.613 ± 0.002PEFridh and Asbrink, 1975LLK
13.60 ± 0.01PEBaker and Turner, 1968RDSH

Vibrational and/or electronic energy levels

Data compiled by: Takehiko Shimanouchi

Symmetry:   C∞ν     Symmetry Number σ = 1

 Sym.   No   Approximate   Selected Freq.  Infrared   Raman   Comments
 Species   type of mode   Value   Rating   Value  Phase  Value  Phase

σ+ 1 CD str 2630  A 2630.30 S gas 2630 liq.
π 2 Bend 569  A 569.04 VS gas 569 liq.
σ+ 3 CN str 1925  A 1925.26 W gas 1906 liq.

Source: Shimanouchi, 1972

References

Stull, 1947
Stull, Daniel R., Vapor Pressure of Pure Substances. Organic and Inorganic Compounds, Ind. Eng. Chem., 1947, 39, 4, 517-540, https://doi.org/10.1021/ie50448a022 . [all data]

Lewis and Schutz, 1934
Lewis, Gilbert N.; Schutz, Philip W., THE VAPOR PRESSURE OF LIQUID AND SOLID DEUTOCYANIC ACID, J. Am. Chem. Soc., 1934, 56, 4, 1002-1002, https://doi.org/10.1021/ja01319a514 . [all data]

Fridh and Asbrink, 1975
Fridh, C.; Asbrink, L., Photoelectron electron impact spectrum of HCN, J. Electron Spectrosc. Relat. Phenom., 1975, 7, 119. [all data]

Baker and Turner, 1968
Baker, C.; Turner, D.W., High resolution molecular photoelectron spectroscopy. III.Acetylenes and azaacetylenes, Proc. Roy. Soc. (London), 1968, A308, 19. [all data]

Shimanouchi, 1972
Shimanouchi, T., Tables of Molecular Vibrational Frequencies Consolidated Volume I, National Bureau of Standards, 1972, 1-160. [all data]