Polydiphenyldiethynylgermanium

Condensed phase thermochemistry data

Data compiled as indicated in comments:
MS - José A. Martinho Simões
DH - Eugene S. Domalski and Elizabeth D. Hearing

Quantity Value Units Method Reference Comment
Δfsolid140.7 ± 1.8kcal/molReviewMartinho SimõesThe title compound is a polymer. The data refer to the monomer.; MS
Quantity Value Units Method Reference Comment
Δcsolid-2116. ± 1.7kcal/molCC-SBLebedev, Lebedev, et al., 1979The title compound is a polymer. The data refer to the monomer.; MS

Constant pressure heat capacity of solid

Cp,solid (cal/mol*K) Temperature (K) Reference Comment
66.78298.15Lebedev, Rabinovich, et al., 1977glass phase; T = 50 to 325 K.; DH

References

Martinho Simões
Martinho Simões, J.A., Private communication (see http://webbook.nist.gov/chemistry/om/). [all data]

Lebedev, Lebedev, et al., 1979
Lebedev, N.K.; Lebedev, B.V.; Kiparisova, E.G.; Sladkov, A.M.; Vasneva, N.A., Dokl. Akad. Nauk SSSR, 1979, 246, 1405. [all data]

Lebedev, Rabinovich, et al., 1977
Lebedev, B.V.; Rabinovich, I.B.; Milov, V.I.; Sladkov, A.M.; Vasneva, N.A., The thermodynamics of the dehydropolycondensation of diphenyldiethylgermanium, Izvest. Akad. Nauk SSSR, Ser. Khim., 1977, (8), 1790-1793. [all data]