Octanoic acid, 2-methyl-

Normal alkane RI, non-polar column, temperature ramp

View large format table.

Column type Active phase I Reference Comment
CapillaryDB-11304.Iranshahi, Amin, et al., 200630. m/0.25 mm/0.25 μm, He, 50. C @ 1. min, 2.5 K/min, 265. C @ 20. min

References

Iranshahi, Amin, et al., 2006
Iranshahi, M.; Amin, G.; Sourmaghi, M.S.; Shafiee, A.; Hadjiakhoondi, A., Sulphur-containing compounds in the essential oil of the root of Ferula persica Willd. var. persica, Flavour Fragr. J., 2006, 21, 2, 260-261, https://doi.org/10.1002/ffj.1574 . [all data]