s-Triazine, 2-chloro-4-(isopropylamino)-6-(methylamino)-

Kovats' RI, polar column, isothermal

View large format table.

Column type Active phase Temperature (C) I Reference Comment
PackedCarbowax 20M215.2761.Leclercq and Pacáková, 1979N2, Chromosorb W

References

Leclercq and Pacáková, 1979
Leclercq, P.A.; Pacáková, V., Gas Chromatography and Mass Spectrometry of Bis(alkylamino)-s-triazines, J. Chromatogr., 1979, 178, 1, 193-207, https://doi.org/10.1016/S0021-9673(00)89708-3 . [all data]