4H-Pyran-4-one, tetrahydro-

Phase change data

Data compiled as indicated in comments:
BS - Robert L. Brown and Stephen E. Stein
AC - William E. Acree, Jr., James S. Chickos

Quantity Value Units Method Reference Comment
Tboil439.7KN/AWeast and Grasselli, 1989BS
Quantity Value Units Method Reference Comment
Δvap50.7 ± 0.3kJ/molCFreitas, Gomes, et al., 2009AC

References

Weast and Grasselli, 1989
CRC Handbook of Data on Organic Compounds, 2nd Editon, Weast,R.C and Grasselli, J.G., ed(s)., CRC Press, Inc., Boca Raton, FL, 1989, 1. [all data]

Freitas, Gomes, et al., 2009
Freitas, Vera L.S.; Gomes, José R.B.; Ribeiro da Silva, Maria D.M.C., Energetic studies of two oxygen heterocyclic compounds Xanthone and tetrahydro-«947»-pyrone, J Therm Anal Calorim, 2009, 97, 3, 827-833, https://doi.org/10.1007/s10973-009-0233-y . [all data]