Ethanone, 1-(4,5-dihydro-2-thiazolyl)-

Normal alkane RI, non-polar column, temperature ramp

Data compiled by: NIST Mass Spectrometry Data Center, William E. Wallace, director

Column type CapillaryCapillaryCapillaryCapillaryCapillary
Active phase DB-5DB-5DB-5MSDB-5HP-1
Column length (m) 60.30.30. 25.
Carrier gas HeliumHeHe
Substrate
Column diameter (mm) 0.320.320.53 0.32
Phase thickness (μm) 0.250.251.50.25
Tstart (C)  40.40.34.35.
Tend (C) 240.230.225.200.250.
Heat rate (K/min) 6.6.6.5.4.
Initial hold (min)  2.5.3.
Final hold (min) 5.5.30.10.
I 1108.1106.1109.1098.1055.
ReferenceMallia, Escher, et al., 2009Sanz, Czerny, et al., 2002Cadwallader and Heo, 2001Schlüter, Steinhart, et al., 1999Ong and Acree, 1998
Comment MSDC-RI MSDC-RI MSDC-RI MSDC-RI MSDC-RI
Column type Capillary
Active phase DB-1
Column length (m) 60.
Carrier gas He
Substrate
Column diameter (mm) 0.32
Phase thickness (μm)
Tstart (C) 30.
Tend (C) 200.
Heat rate (K/min) 4.
Initial hold (min) 25.
Final hold (min) 20.
I 1063.
ReferenceButtery, Stern, et al., 1994
Comment MSDC-RI

References

Mallia, Escher, et al., 2009
Mallia, S.; Escher, F.; Dubois, S.; Schieberle, P.; Schlichtherle-Cerny, H., Characterization and quantification of odor-active compounds in unsaturated fatty acid/conjugated linoleic acid (UFA/CLA)-enriched butter and in conventional butter during storage and induced oxidation, J. Agric. Food Chem., 2009, 57, 16, 7464-7472, https://doi.org/10.1021/jf9002158 . [all data]

Sanz, Czerny, et al., 2002
Sanz, C.; Czerny, M.; Cid, C.; Schieberle, P., Comparison of potent odorants in a filtered coffee brew and in an instant coffee beverage by aroma extract dilution analysis (AEDA), Eur. Food Res. Technol., 2002, 214, 4, 299-302, https://doi.org/10.1007/s00217-001-0459-9 . [all data]

Cadwallader and Heo, 2001
Cadwallader, K.R.; Heo, J., Aroma of roasted sesame oil: characterization by direct thermal desorption-gas chromatography-olfactometry and sample dilution analysis, Am. Chem. Soc. Symp. Ser., 2001, 782, 187-202. [all data]

Schlüter, Steinhart, et al., 1999
Schlüter, S.; Steinhart, H.; Schwarz, F.J.; Kirchgessner, M., Changes in the odorants of boiled carp fillet (Cyprinus carpio L.) as affected by increasing methionine levels in feed, J. Agric. Food Chem., 1999, 47, 12, 5146-5150, https://doi.org/10.1021/jf9902604 . [all data]

Ong and Acree, 1998
Ong, P.K.C.; Acree, T.E., Gas chromatography/olfactory analysis of lychee (Litchi chinesis Sonn.), J. Agric. Food Chem., 1998, 46, 6, 2282-2286, https://doi.org/10.1021/jf9801318 . [all data]

Buttery, Stern, et al., 1994
Buttery, R.G.; Stern, D.J.; Ling, L.C., Studies on flavor volatiles of some sweet corn products, J. Agric. Food Chem., 1994, 42, 3, 791-795, https://doi.org/10.1021/jf00039a038 . [all data]