Iodo-bis(methoxy)borane

Gas phase ion energetics data

Data compiled by: Henry M. Rosenstock, Keith Draxl, Bruce W. Steiner, and John T. Herron

Ionization energy determinations

IE (eV) Method Reference
9.63EILappert, Litzow, et al., 1970

References

Lappert, Litzow, et al., 1970
Lappert, M.F.; Litzow, M.R.; Pedley, J.B.; Riley, P.N.K.; Spalding, T.R.; Tweedale, A., Bonding studies of compounds of boron and the group IV elements. Part III.First ionisation potentials of some simple boron compounds by electron impact and by a new empirical molecular orbital method, J. Chem. Soc. A, 1970, 2320. [all data]