γ-Elemene

Normal alkane RI, non-polar column, temperature ramp

Data compiled by: NIST Mass Spectrometry Data Center, William E. Wallace, director

Column type CapillaryCapillaryCapillaryCapillaryCapillary
Active phase DB-5DB-5HP-5HP-5 MSDB-5
Column length (m) 30.25.30.30.50.
Carrier gas HeliumNitrogenHeliumHeliumNitrogen
Substrate
Column diameter (mm) 0.250.220.250.250.20
Phase thickness (μm) 0.250.250.320.250.32
Tstart (C) 60.50.60.50.60.
Tend (C) 240.300.250.230.220.
Heat rate (K/min) 3.6.55.3.5.
Initial hold (min)  2.30.10.3.
Final hold (min)  7. 10.5.
I 1437.1426.1431.1434.1431.
ReferenceAlim, Goze, et al., 2009Chieng, Assim, et al., 2008Yassa and Akhani, 2008Adams, Beauchamp, et al., 2007Amiri, 2007
Comment MSDC-RI MSDC-RI MSDC-RI MSDC-RI MSDC-RI
Column type CapillaryCapillaryCapillaryCapillaryCapillary
Active phase HP-5ZB-5HP-5MSHP-5HP-5MS
Column length (m) 30.30.30.30.30.
Carrier gas Helium HeHeHe
Substrate
Column diameter (mm) 0.250.250.250.250.25
Phase thickness (μm) 0.260.250.250.320.25
Tstart (C) 60.60.40.60.40.
Tend (C) 240.220.250.250.260.
Heat rate (K/min) 4.4.3.5.4.
Initial hold (min) 2.5.5.30.
Final hold (min) 20.20.10.
I 1438.1430.1421.1431.1429.5
ReferenceFarsam, Amanlou, et al., 2007Mohottalage, Tabacchi, et al., 2007Vichi, Riu-Aumatell, et al., 2007Yassa and Akhani, 2007Zizovic, Stamenic, et al., 2007
Comment MSDC-RI MSDC-RI MSDC-RI MSDC-RI MSDC-RI
Column type CapillaryCapillaryCapillaryCapillaryCapillary
Active phase DB-5DB-5DB-5CP Sil 5 CBSPB-1
Column length (m) 30.25.30.25.30.
Carrier gas HeN2HeH2He
Substrate
Column diameter (mm) 0.250.250.250.250.25
Phase thickness (μm) 0.250.150.25 0.25
Tstart (C) 60.50.60.50.50.
Tend (C) 220.200.200.230.250.
Heat rate (K/min) 4.4.2.3.4.
Initial hold (min) 5.3.  1.
Final hold (min)   60. 10.
I 1439.1430.1433.1431.1417.
ReferenceMorteza-Semnani K., Akbarzadeh M., et al., 2006Ouamba, Ouabonzi, et al., 2006Rout, Naik, et al., 2006Tesso, König, et al., 2006Wong, Sivasothy, et al., 2006
Comment MSDC-RI MSDC-RI MSDC-RI MSDC-RI MSDC-RI
Column type CapillaryCapillaryCapillaryCapillaryCapillary
Active phase HP-5MSDB-5DB-5SPB-5DB-5
Column length (m) 30.25.30.60.30.
Carrier gas He HeHeHe
Substrate
Column diameter (mm) 0.250.250.250.320.25
Phase thickness (μm) 0.250.150.251.0.25
Tstart (C) 60.40.60.40.60.
Tend (C) 275.220.240.230.300.
Heat rate (K/min) 4.3.3.3.3.
Initial hold (min)  5. 5.3.
Final hold (min)
I 1440.1427.1435.1473.1428.
ReferenceAsadipour, Mehrabani, et al., 2005Chagonda and Chalchat, 2005Chaverri and Cicció, 2005Cornu, Kondjoyan, et al., 2005Ferraz, Limberger, et al., 2005
Comment MSDC-RI MSDC-RI MSDC-RI MSDC-RI MSDC-RI
Column type CapillaryCapillaryCapillaryCapillaryCapillary
Active phase HP-5MSDB-5DB-1RTX-5 MSHP-5MS
Column length (m) 25.30.50.30.30.
Carrier gas HeHeN2HeHe
Substrate
Column diameter (mm) 0.250.250.250.250.25
Phase thickness (μm)  0.250.250.250.32
Tstart (C) 50.60.95.50.60.
Tend (C) 250.220.240.280.250.
Heat rate (K/min) 3.4.4.8.5.
Initial hold (min) 3.4. 2.3.
Final hold (min) 10.  2.
I 1434.1439.1429.1442.1436.
ReferenceGhasemi Y., Faridi P., et al., 2005Morteza-Semnani and Saeedi, 2005Pala-Paul, Perez-Alonso, et al., 2005Pellati, Benvenuti, et al., 2005Pourmortazavi, Ghadiri, et al., 2005
Comment MSDC-RI MSDC-RI MSDC-RI MSDC-RI MSDC-RI
Column type CapillaryCapillaryCapillaryCapillaryCapillary
Active phase DB-1DB-1HP-5MSDB-1DB-1
Column length (m) 30.50.30.50.30.
Carrier gas HeN2 N2He
Substrate
Column diameter (mm) 0.250.250.250.250.25
Phase thickness (μm) 0.250.250.250.250.25
Tstart (C) 50.90.40.95.50.
Tend (C) 265.240.220.240.265.
Heat rate (K/min) 2.54.3.4.2.5
Initial hold (min) 1. 5. 1.
Final hold (min) 20. 10. 20.
I 1415.1423.1421.1423.1415.
ReferenceSarkhail, Amin, et al., 2005Velasco-Negueruela, Pérez-Alonso, et al., 2005Vichi, Riu-Aumatell, et al., 2005Palá-Paúl, Velasco-Negueruela, et al., 2004Sarkhail, Amin, et al., 2004
Comment MSDC-RI MSDC-RI MSDC-RI MSDC-RI MSDC-RI
Column type CapillaryCapillaryCapillaryCapillaryCapillary
Active phase HP-5MSDB-5HP-5DB-5HP-5
Column length (m) 30.30.30.30.30.
Carrier gas HeHeHeliumHeHe
Substrate
Column diameter (mm) 0.250.250.320.250.25
Phase thickness (μm) 0.250.25 0.250.25
Tstart (C) 60.60.70.60.60.
Tend (C) 280.280.210.275.280.
Heat rate (K/min) 4.3.2.4.4.
Initial hold (min)    5.
Final hold (min)  30.60.
I 1433.1420.1433.1433.1432.
ReferenceGhasemi, Asghari, et al., 2003Marongiu, Porcedda, et al., 2003Mookdasanit, Tamura, et al., 2003Morteza-Semnani and Saeedi, 2003Sajjadi and Mehregan, 2003
Comment MSDC-RI MSDC-RI MSDC-RI MSDC-RI MSDC-RI
Column type CapillaryCapillaryCapillaryCapillaryCapillary
Active phase HP-5DB-55 % Phenyl methyl siloxaneRSL-200DB-1
Column length (m) 30.30.30.30.25.
Carrier gas HeHeHeH2He
Substrate
Column diameter (mm) 0.250.250.250.320.23
Phase thickness (μm) 0.320.250.250.250.20
Tstart (C) 60.60.75.40.50.
Tend (C) 250.240.200.280.200.
Heat rate (K/min) 5.3.3.6.3.
Initial hold (min) 30. 4.5.3.
Final hold (min)   8.5.30.
I 1436.1430.1437.1425.1446.
ReferenceYassa, Akhani, et al., 2003Zoghbi, Andrade, et al., 2003Cicció and Gómez-Laurito, 2002Jirovetz, Buchbauer, et al., 2002Khallouki, Younos, et al., 2002
Comment MSDC-RI MSDC-RI MSDC-RI MSDC-RI MSDC-RI
Column type CapillaryCapillaryCapillaryCapillaryCapillary
Active phase DB-5OV-101DB-5MSRTX-1DB-1
Column length (m) 30.50.30.30.30.
Carrier gas HeHeHeN2He
Substrate
Column diameter (mm) 0.250.20.250.250.2
Phase thickness (μm) 0.250.50.250.25
Tstart (C) 60.50.60.60.60.
Tend (C) 240.250.270.300.240.
Heat rate (K/min) 3.2.3.4.3.
Initial hold (min)
Final hold (min)
I 1433.1423.1432.1427.1435.5
ReferenceKobaisy, Tellez, et al., 2002Orav, Kailas, et al., 2002Zoghbi, Andrade, et al., 2002Kalemba, Marschall, et al., 2001Santos, Moreira, et al., 2001
Comment MSDC-RI MSDC-RI MSDC-RI MSDC-RI MSDC-RI
Column type CapillaryCapillaryCapillaryCapillaryCapillary
Active phase DB-1CP Sil 5 CBDB-1HP-1CP Sil 5 CB
Column length (m) 60.25.33.60.25.
Carrier gas N2HeN2HeN2
Substrate
Column diameter (mm) 0.250.250.250.250.32
Phase thickness (μm) 0.250.40.500.250.25
Tstart (C) 60.60.50.60.50.
Tend (C) 220.260.135.200.290.
Heat rate (K/min) 3.5.20.4.4.
Initial hold (min) 5.40.2.5.
Final hold (min) 22.  25.
I 1440.1425.1442.1438.1482.
ReferenceBailac, Dellacasa, et al., 2000Baser, Özek, et al., 2000Feger, Brandauer, et al., 2000Meccia, Rojas, et al., 2000Bos, Woerdenbag, et al., 1997
Comment MSDC-RI MSDC-RI MSDC-RI MSDC-RI MSDC-RI
Column type CapillaryCapillaryCapillaryCapillaryCapillary
Active phase CP Sil 5 CBCP Sil 5 CBOV-1HP-5SE-54
Column length (m) 25.25.30. 30.
Carrier gas N2He  Hydrogen
Substrate
Column diameter (mm) 0.320.250.32 0.25
Phase thickness (μm) 0.250.250.25 0.25
Tstart (C) 50.60.40.35.60.
Tend (C) 290.300.270.200.250.
Heat rate (K/min) 4.6.2.6.2.
Initial hold (min)   4.2.5.
Final hold (min)     2.
I 1482.1482.1475.1458.1430.
ReferenceBos, Woerdenbag, et al., 1997Bos, Woerdenbag, et al., 1997, 2Kökdil, Tanker, et al., 1997Larsen and Frisvad, 1995Kollmannsberger, Nitz, et al., 1992
Comment MSDC-RI MSDC-RI MSDC-RI MSDC-RI MSDC-RI
Column type CapillaryCapillary
Active phase SE-30SE-30
Column length (m) 30.30.
Carrier gas
Substrate
Column diameter (mm)
Phase thickness (μm)
Tstart (C) 50.50.
Tend (C) 240.240.
Heat rate (K/min) 4.4.
Initial hold (min) 2.2.
Final hold (min) 10.10.
I 1425.1425.
ReferenceRamaswami, Briscese, et al., 1988Ramaswami, Briscese, et al., 1986
Comment MSDC-RI MSDC-RI

Normal alkane RI, polar column, temperature ramp

Data compiled by: NIST Mass Spectrometry Data Center, William E. Wallace, director

Column type CapillaryCapillaryCapillaryCapillaryCapillary
Active phase CP-Wax 52CBSupelcowax-10DB-WaxSupelcowax-10Supelcowax-10
Column length (m) 30.30.60.30.30.
Carrier gas HeHeHeHe
Substrate
Column diameter (mm) 0.320.250.250.250.25
Phase thickness (μm) 0.250.250.250.250.25
Tstart (C) 40.40.60.50.40.
Tend (C) 220.250.180.250.220.
Heat rate (K/min) 3.3.3.4.3.
Initial hold (min) 1.5.8.1.5.
Final hold (min) 2.10.80.10.10.
I 1650.1618.1641.1624.1618.
ReferenceHymete, Rohloff, et al., 2007Vichi, Riu-Aumatell, et al., 2007Wei A. and Shibamoto T., 2007Wong, Sivasothy, et al., 2006Vichi, Riu-Aumatell, et al., 2005
Comment MSDC-RI MSDC-RI MSDC-RI MSDC-RI MSDC-RI
Column type CapillaryCapillaryCapillaryCapillaryCapillary
Active phase Supelcowax-10DB-WaxDB-WaxDB-WaxCP-Wax 52CB
Column length (m) 30.60.60.60.60.
Carrier gas HeN2N2HeHe
Substrate
Column diameter (mm) 0.250.250.250.320.25
Phase thickness (μm) 0.250.250.250.250.25
Tstart (C) 50.70.70.35.40.
Tend (C) 220.230.230.220.220.
Heat rate (K/min) 4.2.2.3.3.
Initial hold (min) 3.2.2.
Final hold (min) 30.20.20.
I 1626.1639.1636.1638.1636.
ReferenceWong, Lee, et al., 2005Choi, 2004Choi, 2004, 2Palá-Paúl, Brophy, et al., 2004Mau, Lai, et al., 2003
Comment MSDC-RI MSDC-RI MSDC-RI MSDC-RI MSDC-RI
Column type CapillaryCapillaryCapillaryCapillaryCapillary
Active phase DB-WaxDB-WaxCarbowax 20MDB-WaxTC-Wax
Column length (m) 60.60.30.60.60.
Carrier gas HeliumN2HeHeHe
Substrate
Column diameter (mm) 0.250.250.250.250.25
Phase thickness (μm)  0.250.3250.25
Tstart (C) 70.70.50.40.80.
Tend (C) 210.230.215.200.250.
Heat rate (K/min) 2.2.4.2.4.
Initial hold (min)  2. 2.
Final hold (min) 60.20.20. 47.
I 1641.1619.1642.1625.1628.
ReferenceMookdasanit, Tamura, et al., 2003Tu, Onishi, et al., 2003Kasali, Winterhalter, et al., 2002Umano, Hagi, et al., 2002Miyazawa, Kurose, et al., 2001
Comment MSDC-RI MSDC-RI MSDC-RI MSDC-RI MSDC-RI
Column type CapillaryCapillaryCapillaryCapillaryCapillary
Active phase Carbowax 20MInnowaxDB-WaxDB-WaxCarbowax 20M
Column length (m) 50.60.30.30.45.
Carrier gas HeHeN2N2Hydrogen
Substrate
Column diameter (mm) 0.220.250.250.250.32
Phase thickness (μm) 0.250.250.250.251.0
Tstart (C) 60.60.45.45.60.
Tend (C) 220.220.220.220.200.
Heat rate (K/min) 2.4.3.3.2.
Initial hold (min)  10.  5.
Final hold (min)  10.
I 1620.1651.1665.1648.1625.
ReferenceVernin, Lageot, et al., 2001Baser, Özek, et al., 2000Molleken U., Sinnwell V., et al., 1998Mölleken, Sinnwell, et al., 1998Kollmannsberger, Nitz, et al., 1992
Comment MSDC-RI MSDC-RI MSDC-RI MSDC-RI MSDC-RI
Column type CapillaryCapillary
Active phase Supelcowax-10Supelcowax-10
Column length (m) 30.30.
Carrier gas  He
Substrate
Column diameter (mm)
Phase thickness (μm)
Tstart (C) 50.50.
Tend (C) 240.240.
Heat rate (K/min) 4.4.
Initial hold (min) 2.2.
Final hold (min) 10.10.
I 1642.1642.
ReferenceRamaswami, Briscese, et al., 1988Ramaswami, Briscese, et al., 1986
Comment MSDC-RI MSDC-RI

References

Alim, Goze, et al., 2009
Alim, A.; Goze, I.; Cetin, A.; Atas, A.; Vural, N.; Donmez, E., Antimicrobial activity of the essential oil of Cyclotrichimun niveum (Boiss.) Manden. Et Scheng, African J. Microbiol. Res., 2009, 3, 8, 422-425. [all data]

Chieng, Assim, et al., 2008
Chieng, T.C.; Assim, Z.B.; Fasihuddin, B.A., Toxicity and antitermite activities of the essential oils from Piper sarmentosum, The Malaysian J. Anal. Sci., 2008, 12, 1, 234-239. [all data]

Yassa and Akhani, 2008
Yassa, N.; Akhani, H., The essential oils composition in two species of the genus Eriocycla Lindl. (Apiaceae) from Iran, 2008, retrieved from http://biology.ut.ac.ir/members/akhani/PdfReprintNumber/27.pdf. [all data]

Adams, Beauchamp, et al., 2007
Adams, R.P.; Beauchamp, P.S.; Dev, V.; Dutz, S.M., New Natural Products Isolated from One-Seeded Juniperus of the Southwestern United States: Isolation and Occurence of 2-Ethenyl-3-methyl Phanol and Its Derivatives, J. Essent. Oil Res., 2007, 19, 2, 146-152, https://doi.org/10.1080/10412905.2007.9699247 . [all data]

Amiri, 2007
Amiri, H., Quantative and qualative changes of essential oil of Salvia bracteata BAnk et Sol. in different growth stages, DARU, 2007, 15, 2, 79-82. [all data]

Farsam, Amanlou, et al., 2007
Farsam, H.; Amanlou, M.; Taghi-Cheetsaz, N.; Amin, G.R.; Saledi-Sormaghi, M.H., Essential Oil of Chimonanthus fragrans flowers Population of Tehran, DARU, 2007, 15, 3, 129-131. [all data]

Mohottalage, Tabacchi, et al., 2007
Mohottalage, S.; Tabacchi, R.; Guerin, P.M., Components from Sri Lankan Piper betle L. leaf oil and their analogues showing toxicity against the housefly, Musca domestica, Flavour Fragr. J., 2007, 22, 2, 130-138, https://doi.org/10.1002/ffj.1770 . [all data]

Vichi, Riu-Aumatell, et al., 2007
Vichi, S.; Riu-Aumatell, M.; Mora-Pons, M.; Guadayol, J.M.; Buxaderas, S.; López-Tamames, E., Analytical, Nutritional and Clinical Methods. HS-SPME coupled to GC/MS for quality control of Juniperus communis L. berries used for gin aromatization, Food Chem., 2007, 105, 4, 1748-1754, https://doi.org/10.1016/j.foodchem.2007.03.026 . [all data]

Yassa and Akhani, 2007
Yassa, N.; Akhani, H., The essential oils composition in two species of the genus Eriocycla Lindl. (Apiaceae) from Iran, 2007, retrieved from http://biology.ut.ac.ir/members/akhani/PdfReprintNumber/27.pdf. [all data]

Zizovic, Stamenic, et al., 2007
Zizovic, I.; Stamenic, M.; Ivanovic, J.; Orlovic, A.; Ristic, M.; Djordjevic, S.; Petrovic, S.D.; Skala, D., Supercritical carbon dioxide extraction of sesquiterpenes from valerian root, J. Supercrit. Fluids, 2007, 43, 2, 249-258, https://doi.org/10.1016/j.supflu.2007.05.007 . [all data]

Morteza-Semnani K., Akbarzadeh M., et al., 2006
Morteza-Semnani K.; Akbarzadeh M.; Moshiri K., The essential oil composition of Eupatorium cannabinum L. from Iran, Flavour Fragr. J., 2006, 21, 3, 521-523, https://doi.org/10.1002/ffj.1687 . [all data]

Ouamba, Ouabonzi, et al., 2006
Ouamba, J.-M.; Ouabonzi, A.; Ekouya, A.; Bessière, J.-M.; Menut, C.; Abena, A.A.; Banzouzi, J.-T., Volatile constituents of the essential oil leaf of Lantana salvifolia Jacq. (Verbenaceae), Flavour Fragr. J., 2006, 21, 1, 158-161, https://doi.org/10.1002/ffj.1553 . [all data]

Rout, Naik, et al., 2006
Rout, P.K.; Naik, S.N.; Rao, Y.R., Composition of the concrete, absolute, headspace and essential oil of the flowers of Michelia champaca Linn., Flavour Fragr. J., 2006, 21, 6, 906-911, https://doi.org/10.1002/ffj.1742 . [all data]

Tesso, König, et al., 2006
Tesso, H.; König, W.A.; Son, P.T.; Giang, P.M., Composition of the essential oil of flowers of Chloranthus spicatus (Thunb.) Makino, Flavour Fragr. J., 2006, 21, 4, 592-597, https://doi.org/10.1002/ffj.1528 . [all data]

Wong, Sivasothy, et al., 2006
Wong, K.C.; Sivasothy, Y.; Boey, P.L., Essential oil of Elettariopsis elan C.K. Lim, Flavour Fragr. J., 2006, 21, 3, 562-564, https://doi.org/10.1002/ffj.1654 . [all data]

Asadipour, Mehrabani, et al., 2005
Asadipour, A.; Mehrabani, M.; Najafi, M.L., Volatile oil composition of Centaurea aucheri (DC.) wagenitz, DARU, 2005, 13, 3, 160-164. [all data]

Chagonda and Chalchat, 2005
Chagonda, L.S.; Chalchat, J.-C., The essential oil of the fruit of Garcinia huillensis Welw. ex. Oliv. from Zimbabwe, Flavour Fragr. J., 2005, 20, 3, 313-315, https://doi.org/10.1002/ffj.1420 . [all data]

Chaverri and Cicció, 2005
Chaverri, C.; Cicció, J.F., Essential oil of trees of the genus Ocotea (Lauraceae) in Costa Rica. I. Ocotea brenesii, Rev. Biol. Trop., 2005, 53, 3-4, 431-436, https://doi.org/10.15517/rbt.v53i3-4.14611 . [all data]

Cornu, Kondjoyan, et al., 2005
Cornu, A.; Kondjoyan, N.; Martin, B.; Verdier-Metz, I.; Pradel, P.; Berdague, J.-L.; Coulon, J.-B., Terpene profiles in Cantal and Saint-Nectairetype cheese made from raw or pasteurised milk, J. Sci. Food Agric., 2005, 85, 12, 2040-2046, https://doi.org/10.1002/jsfa.2214 . [all data]

Ferraz, Limberger, et al., 2005
Ferraz, A.B.F.; Limberger, R.P.; Bordignon, S.A.L.; von Poser, G.L.; Henriques, A.T., Essential oil composition of six Hypericum species from southern Brazil, Flavour Fragr. J., 2005, 20, 3, 335-339, https://doi.org/10.1002/ffj.1435 . [all data]

Ghasemi Y., Faridi P., et al., 2005
Ghasemi Y.; Faridi P.; Mehregan I.; Mohagheghzadeh A., Ferula gummosa fruits: An aromatic antimicrobial agent, Chem. Nat. Compd. (Engl. Transl.), 2005, 41, 3, 311-314, https://doi.org/10.1007/s10600-005-0138-3 . [all data]

Morteza-Semnani and Saeedi, 2005
Morteza-Semnani, K.; Saeedi, M., The essential oil composition of Phlomis bruguieri Desf. from Iran, Flavour Fragr. J., 2005, 20, 3, 344-346, https://doi.org/10.1002/ffj.1459 . [all data]

Pala-Paul, Perez-Alonso, et al., 2005
Pala-Paul, J.; Perez-Alonso, M.J.; Velasco-Negueruela, A.; Vadare, J.; Villa, A.M.; Sanz, J.; Brophy, J.J., Essential oil composition of the different parts of Eryngium bourgatii Gouan from Spain, J. Chromatogr. A, 2005, 1074, 1-2, 235-239, https://doi.org/10.1016/j.chroma.2005.03.036 . [all data]

Pellati, Benvenuti, et al., 2005
Pellati, F.; Benvenuti, S.; Yoshizaki, F.; Bertelli, D.; Rossi, M.C., Headspace solid-phase microextraction-gas chromatography-mass spectrometry analysis of the volatile compounds of Evodia species fruits, J. Chromatogr. A, 2005, 1087, 1-2, 265-273, https://doi.org/10.1016/j.chroma.2005.01.060 . [all data]

Pourmortazavi, Ghadiri, et al., 2005
Pourmortazavi, S.M.; Ghadiri, M.; Hajimirsadeghi, S.S., Supercritical fluid extraction of volatile components from Bunium persicum Boiss. (black cumin) and Mespilus germanica L. (medlar) seeds, J. Food Comp. Anal., 2005, 18, 5, 439-446, https://doi.org/10.1016/j.jfca.2004.01.003 . [all data]

Sarkhail, Amin, et al., 2005
Sarkhail, P.; Amin, G.; Surmaghi, M.H.S.; Shafiee, A., Composition of the volatile oils of Phlomis lanceolata Boiss. Hohen., Phlomis anisodonta Boiss. and Phlomis bruguieri Desf. from Iran, Flavour Fragr. J., 2005, 20, 3, 327-329, https://doi.org/10.1002/ffj.1427 . [all data]

Velasco-Negueruela, Pérez-Alonso, et al., 2005
Velasco-Negueruela, A.; Pérez-Alonso, M.J.; Pérez de Paz, P.L.; Palá-Paúl, J.; Sanz, J., Analysis by gas chromatography-mass spectrometry of the essential oils from the aerial parts of Pimpinella anagodendron Bolle and Pimpinella rupicola Svent., two endemic species to the Canary Islands, Spain, J. Chromatogr. A, 2005, 1095, 1-2, 180-184, https://doi.org/10.1016/j.chroma.2005.09.074 . [all data]

Vichi, Riu-Aumatell, et al., 2005
Vichi, S.; Riu-Aumatell, M.; Mora-Pons, M.; Buxaderas, S.; Lopez-Tamames, E., Characterization of Volatiles in Different Dry Gins, J. Agric. Food Chem., 2005, 53, 26, 10154-10160, https://doi.org/10.1021/jf058121b . [all data]

Palá-Paúl, Velasco-Negueruela, et al., 2004
Palá-Paúl, J.; Velasco-Negueruela, A.; Pérez-Alonso, M.J.; Maqueda, J.; Sanz, J., Volatile oil constituents from different parts of Cachrys trifida L., J. Essent. Oil Res., 2004, 16, 4, 347-349, https://doi.org/10.1080/10412905.2004.9698738 . [all data]

Sarkhail, Amin, et al., 2004
Sarkhail, P.; Amin, G.; Shafiee, A., Composition of the essential oil of Phlomis persica Boiss and Phlomis chorassanica Bunge from Iran, Flavour Fragr. J., 2004, 19, 6, 538-540, https://doi.org/10.1002/ffj.1338 . [all data]

Ghasemi, Asghari, et al., 2003
Ghasemi, N.; Asghari, G.; Ardakani, M.S.; Siahpoush, A., Characterization of volatile constituents from aerial parts of varthemia persica DC (var. persica), Iran. J. Pharm. Res., 2003, 2, 241-243. [all data]

Marongiu, Porcedda, et al., 2003
Marongiu, B.; Porcedda, S.; Caredda, A.; de Gioannis, B.; Vargiu, L.; la Colla, P., Extraction of Juniperus oxycedrus ssp. Oxycedrus essential oil by supercritical carbon dioxide: influence of some process parameters and biological activity, Flavour Fragr. J., 2003, 18, 5, 390-397, https://doi.org/10.1002/ffj.1224 . [all data]

Mookdasanit, Tamura, et al., 2003
Mookdasanit, J.; Tamura, H.; Yoshizawa T.; Tokunaga T.; Nakanishi, K., Trace Volatile Compounds in Essential Oil of Citrus Sudachi by Means of Modified Solvent Extraction Method, Food Sci Technol. Res., 2003, 9, 1, 54-61, https://doi.org/10.3136/fstr.9.54 . [all data]

Morteza-Semnani and Saeedi, 2003
Morteza-Semnani, K.; Saeedi, M., Constituents of the essential oil of Commiphora myrrha (Nees) Engl. var. molmol, J. Essent. Oil Res., 2003, 15, 1, 50-51, https://doi.org/10.1080/10412905.2003.9712264 . [all data]

Sajjadi and Mehregan, 2003
Sajjadi, S.E.; Mehregan, I., Chemical composition of the essential oil of Prangos Asperula Boiss. subsp. haussknechtii (Boiss.) Hernst. et Heyn fruits, 2003, retrieved from http://www1.tums.ac.ir/daru/daru2%2020003/Dr%20Sajadi.PDF. [all data]

Yassa, Akhani, et al., 2003
Yassa, N.; Akhani, H.; Aqaahmadi, M.; Salimian, M., Essential oils from two endemic species of Apiaceae from Iran, Z. Naturforsch. C:, 2003, 58, 459-463. [all data]

Zoghbi, Andrade, et al., 2003
Zoghbi, M.G.B.; Andrade, E.H.A.; da Silva, M.H.; Carreira, L.M.M.; Maia, J.G.S., Essential oils from three Myrcia species, Flavour Fragr. J., 2003, 18, 5, 421-424, https://doi.org/10.1002/ffj.1242 . [all data]

Cicció and Gómez-Laurito, 2002
Cicció, J.F.; Gómez-Laurito, J., Volatile constituents of the leaves of Siparuna thecaphora (Siparunaceae) from Turrialba, Costa Rica, Rev. Biol. Trop., 2002, 50, 3/4, 963-967. [all data]

Jirovetz, Buchbauer, et al., 2002
Jirovetz, L.; Buchbauer, G.; Ngassoum, M.B.; Geissler, M., Aroma compound analysis of Piper nigrum and Piper guineense essential oils from Cameroon using solid-phase microextraction-gas chromatography, solid-phase microextraction-gas chromatography-mass spectrometry and olfactometry, J. Chromatogr. A, 2002, 976, 1-2, 265-275, https://doi.org/10.1016/S0021-9673(02)00376-X . [all data]

Khallouki, Younos, et al., 2002
Khallouki, F.; Younos, C.; Soulimani, R.; Bessière, J.M., Chemical composition of the essential oils of Annona cuneata L. and Annona senegalensis Pers. stem barks, Flavour Fragr. J., 2002, 17, 5, 398-400, https://doi.org/10.1002/ffj.1115 . [all data]

Kobaisy, Tellez, et al., 2002
Kobaisy, M.; Tellez, M.R.; Dayan, F.E.; Duke, S.O., Phytotoxicity and volatile constituents from leaves of Callicarpa japonica Thunb., Phytochemistry, 2002, 61, 1, 37-40, https://doi.org/10.1016/S0031-9422(02)00207-8 . [all data]

Orav, Kailas, et al., 2002
Orav, A.; Kailas, T.; Müürisepp, M., Composition of blackcurrant aroma isolated from leaves, buds, and berries of Ribes nigrum L., Proc. Est. Acad. Sci. Chem., 2002, 51, 4, 225-234. [all data]

Zoghbi, Andrade, et al., 2002
Zoghbi, M.G.B.; Andrade, E.H.A.; da Silva, M.H.L.; Maia, J.G.S., Volatile constituents of Lippia lupulina Cham., Flavour Fragr. J., 2002, 17, 1, 29-31, https://doi.org/10.1002/ffj.1032 . [all data]

Kalemba, Marschall, et al., 2001
Kalemba, D.; Marschall, H.; Bradesi, P., Constituents of the essential oil of Solidago gigantea Ait. (giant goldenrod), Flavour Fragr. J., 2001, 16, 1, 19-26, https://doi.org/10.1002/1099-1026(200101/02)16:1<19::AID-FFJ940>3.0.CO;2-U . [all data]

Santos, Moreira, et al., 2001
Santos, P.R.; Moreira, D.L.; Guimaraes, E.F.; Kaplan, M.A.C., Essential oil analysis of 10 piperaceae species from the Brazilian Atlantic forest, Phytochemistry, 2001, 58, 4, 547-551, https://doi.org/10.1016/S0031-9422(01)00290-4 . [all data]

Bailac, Dellacasa, et al., 2000
Bailac, P.N.; Dellacasa, A.D.; Bernasconi, H.O.; Firpo, N.H.; Ponzi, M.I., Composicion del aceite esencial y actividad antimicrobiana de eupatorium patens, Bol. Soc. Chil. Quim., 2000, 45, 207-211. [all data]

Baser, Özek, et al., 2000
Baser, K.H.C.; Özek, T.; Demirci, B.; Kürkcüoglu, M.; Aytac, Z.; Duman, H., Composition of the essential oils of Zosima absinthifolia (Vent.) Link and Ferula elaeochytris Korovin from Turkey, Flavour Fragr. J., 2000, 15, 6, 371-372, https://doi.org/10.1002/1099-1026(200011/12)15:6<371::AID-FFJ919>3.0.CO;2-Z . [all data]

Feger, Brandauer, et al., 2000
Feger, W.; Brandauer, H.; Ziegler, H., Sesquiterpene hydrocarbons of cold-pressed lime oils, Flavour Fragr. J., 2000, 15, 4, 281-284, https://doi.org/10.1002/1099-1026(200007/08)15:4<281::AID-FFJ916>3.0.CO;2-W . [all data]

Meccia, Rojas, et al., 2000
Meccia, G.; Rojas, L.B.; Rosquete, C.; Feliciano, A.S., Essential oil of Croton ovalifolius Vahl from Venezuela, Flavour Fragr. J., 2000, 15, 3, 144-146, https://doi.org/10.1002/1099-1026(200005/06)15:3<144::AID-FFJ882>3.0.CO;2-C . [all data]

Bos, Woerdenbag, et al., 1997
Bos, R.; Woerdenbag, H.J.; Hendriks, H.; Smit, H.F.; Wikström, H.V.; Scheffer, J.J.C., Composition of the essential oil from roots and rhizomes of Valeriana wallichii DC, Flavour Fragr. J., 1997, 12, 2, 123-131, https://doi.org/10.1002/(SICI)1099-1026(199703)12:2<123::AID-FFJ613>3.0.CO;2-4 . [all data]

Bos, Woerdenbag, et al., 1997, 2
Bos, R.; Woerdenbag, H.J.; Hendriks, H.; Scheffer, J.J.C., Composition of the essential oils from underground parts of Valeriana officinalis L. s.l. and several closely related taxa, Flavour Fragr. J., 1997, 12, 5, 359-370, https://doi.org/10.1002/(SICI)1099-1026(199709/10)12:5<359::AID-FFJ660>3.0.CO;2-G . [all data]

Kökdil, Tanker, et al., 1997
Kökdil, G.; Tanker, M.; Kurucu, S.; Topcu, G., Essential oil analysis of Nepeta cilicia Boiss., Flavour Fragr. J., 1997, 12, 2, 99-101, https://doi.org/10.1002/(SICI)1099-1026(199703)12:2<99::AID-FFJ619>3.0.CO;2-# . [all data]

Larsen and Frisvad, 1995
Larsen, T.O.; Frisvad, J.C., Characterization of volatile metabolites from 47 Penicillium taxa, Mycol. Res., 1995, 99, 10, 1153-1166, https://doi.org/10.1016/S0953-7562(09)80271-2 . [all data]

Kollmannsberger, Nitz, et al., 1992
Kollmannsberger, H.; Nitz, S.; Drawert, F., UBer die Aromastoffzusammensetzung von Hochdruckextrakten. I. Pfeffer (Piper nigrum, Var. muntok), Z. Lebensm. Unters Forsch., 1992, 194, 6, 545-551, https://doi.org/10.1007/BF01185481 . [all data]

Ramaswami, Briscese, et al., 1988
Ramaswami, S.K.; Briscese, P.; Gargiullo, R.J.; von Geldern, T., Sesquiterpene hydrocarbons: from mass confusion to orderly line-up in Flavors and Fragrances: A World Perspective. Proceedings of the 10th International Congress of Essential Oils, Fragrances and Flavors, Lawrence,B.M.; Mookherjee,B.D.; Willis,B.J., ed(s)., Elsevier, New York, 1988, 951-980. [all data]

Ramaswami, Briscese, et al., 1986
Ramaswami, S.K.; Briscese, P.; Gargiullo, R.J.; von Geldern, T., Sesquiterpene hydrocarbons: from mass confusion to orderly line-up in Flavors and Fragrances: A World Perspective, Lawrence,B.M.; Mookherjee,B.D.; Willis,B.J., ed(s)., Proceedings of the 10th International Congress of Essential Oils, Fragrances, and Flavors, Washington, DC, 1986, 951-959. [all data]