Tripropyl gallium

Phase change data

Data compiled by: William E. Acree, Jr., James S. Chickos

Enthalpy of vaporization

ΔvapH (kcal/mol) Temperature (K) Reference Comment
11.1 ± 0.1350.Baev, 2001Based on data from 316. - 385. K.
11.8335.Oliver and Stevens, 1962Based on data from 298. - 373. K.

References

Baev, 2001
Baev, A.K., Izv. Vyssh. Uchebn. Zaved., Khim. Khim. Tekhnol., 2001, 44, 1, 3. [all data]

Oliver and Stevens, 1962
Oliver, J.P.; Stevens, L.G., The preparation and characterization of tri-N-propyl-, tri-isopropyl- and trivinylgallium, Journal of Inorganic and Nuclear Chemistry, 1962, 24, 8, 953-960, https://doi.org/10.1016/0022-1902(62)80212-7 . [all data]