Naphthalene, 1,2,3,4-tetrahydro-5-nitro-

Lee's RI, non-polar column, temperature ramp

View large format table.

Column type Active phase I Reference Comment
CapillarySE-52270.98White, Robbat, et al., 198330. m/0.3 mm/0.25 μm, He, 4. K/min; Tstart: 25. C; Tend: 295. C
CapillarySE-52270.61White, Robbat, et al., 198330. m/0.2 mm/0.25 μm, He, 4. K/min; Tstart: 25. C; Tend: 295. C
CapillarySE-52262.41White, Robbat, et al., 198330. m/0.3 mm/0.25 μm, He, 4. K/min; Tstart: 100. C; Tend: 300. C
CapillarySE-52270.64White, Robbat, et al., 198330. m/0.3 mm/0.25 μm, He, 4. K/min; Tstart: 40. C; Tend: 300. C
CapillarySE-52268.52White, Robbat, et al., 198330. m/0.3 mm/0.25 μm, He, 4. K/min; Tstart: 70. C; Tend: 300. C

References

White, Robbat, et al., 1983
White, C.M.; Robbat, A., Jr.; Hoes, R.M., Gas chromatographic retention characteristics of nitrated polycyclic aromatic hydrocarbons on SE-52, Chromatographia, 1983, 17, 11, 605-612, https://doi.org/10.1007/BF02261944 . [all data]