cyclooctatriene

Phase change data

Data compiled by: Thermodynamics Research Center, NIST Boulder Laboratories, Chris Muzny director

Quantity Value Units Method Reference Comment
Tboil419.KN/AReppe, Schlichting, et al., 1948Uncertainty assigned by TRC = 4. K

In addition to the Thermodynamics Research Center (TRC) data available from this site, much more physical and chemical property data is available from the following TRC products:

References

Reppe, Schlichting, et al., 1948
Reppe, W.; Schlichting, O.; Klager, K.; Toepel, T., Cyclizing Polymerization of Acetylene I. Cyclooctatetraene, Justus Liebigs Ann. Chem., 1948, 560, 1-92. [all data]