N-p-n-Hexyloxybenzylidene-p'-n-butylaniline

Condensed phase thermochemistry data

Data compiled by: Eugene S. Domalski and Elizabeth D. Hearing

Quantity Value Units Method Reference Comment
solid,1 bar128.48cal/mol*KN/AYoshioka, Sorai, et al., 1983
solid,1 bar147.00cal/mol*KN/AYoshioka, Sorai, et al., 1983glass phase; Residual entropy of the glassy state at 0 K was estimated to be 7.51 ± 0.63 J/mol*K.

Constant pressure heat capacity of solid

Cp,solid (cal/mol*K) Temperature (K) Reference Comment
122.38298.15Yoshioka, Sorai, et al., 1983T = 11 to 393 K.
142.24300.Yoshioka, Sorai, et al., 1983glass phase; T = 10 to 310 K.

Phase change data

Data compiled by: Eugene S. Domalski and Elizabeth D. Hearing

Enthalpy of fusion

ΔfusH (kcal/mol) Temperature (K) Reference Comment
5.5664306.60Yoshioka, Sorai, et al., 1983Solid-smectic G.

Entropy of fusion

ΔfusS (cal/mol*K) Temperature (K) Reference Comment
18.16306.60Yoshioka, Sorai, et al., 1983Solid-smectic

Enthalpy of phase transition

ΔHtrs (kcal/mol) Temperature (K) Initial Phase Final Phase Reference Comment
0.192331.56liquidliquidYoshioka, Sorai, et al., 1983
0.8054332.86liquidliquidYoshioka, Sorai, et al., 1983
0.7648343.24liquidliquidYoshioka, Sorai, et al., 1983
0.4517350.92liquidliquidYoshioka, Sorai, et al., 1983

Entropy of phase transition

ΔStrs (cal/mol*K) Temperature (K) Initial Phase Final Phase Reference Comment
0.605331.56liquid, Smectic Gliquid, smectic BYoshioka, Sorai, et al., 1983
2.424332.86liquid, Smectic Bliquid, smectic AYoshioka, Sorai, et al., 1983
2.24343.24liquid, Smectic Aliquid, nematicYoshioka, Sorai, et al., 1983
1.28350.92liquid, Nematicliquid, isotropicYoshioka, Sorai, et al., 1983

References

Yoshioka, Sorai, et al., 1983
Yoshioka, H.; Sorai, M.; Suga, H., Heat capacity of N-p-n-hexyloxybenzylidene-p'-n-butylaniline between 11 and 393 K: unusual glassy smectic liquid crystal, Mol. Cryst. Liq. Cryst., 1983, 95, 11-30. [all data]