Cyclooctacosane

Phase change data

Data compiled by: Thermodynamics Research Center, NIST Boulder Laboratories, Chris Muzny director

Quantity Value Units Method Reference Comment
Tfus321.KN/ASondheimer, Amiel, et al., 1959Uncertainty assigned by TRC = 4. K
Tfus321.KN/ASondheimer and Gaoni, 1959Uncertainty assigned by TRC = 4. K
Tfus321.KN/ASondheimer, Amiel, et al., 1957Uncertainty assigned by TRC = 4. K
Tfus321.KN/ARuzicka, Stoll, et al., 1930Uncertainty assigned by TRC = 3. K

In addition to the Thermodynamics Research Center (TRC) data available from this site, much more physical and chemical property data is available from the following TRC products:

References

Sondheimer, Amiel, et al., 1959
Sondheimer, F.; Amiel, Y.; Wolovsky, R., Unsaturated Macrocyclic Compounds VIII. Oxidation of Terminal Diacetylenes Five New Macrocyclic Rings, J. Am. Chem. Soc., 1959, 81, 4600-6. [all data]

Sondheimer and Gaoni, 1959
Sondheimer, F.; Gaoni, Y., Unsaturated Mocrocyclic Compounds XI. Poly-oxygenated Mocrocyclic Compounds from Hepta-1,6-diyn-4-ol, J. Am. Chem. Soc., 1959, 81, 6301-5. [all data]

Sondheimer, Amiel, et al., 1957
Sondheimer, F.; Amiel, Y.; Wolovsky, R., Unsaturated Macrocyclic Compounds V. Large Ring Poly-acetylenes, J. Am. Chem. Soc., 1957, 79, 4247-8. [all data]

Ruzicka, Stoll, et al., 1930
Ruzicka, L.; Stoll, M.; Huyser, H.; Boekenoogen, H.A., Helv. Chim. Acta, 1930, 13, 1152. [all data]