cycloheptacosane

Phase change data

Data compiled by: Thermodynamics Research Center, NIST Boulder Laboratories, Chris Muzny director

Quantity Value Units Method Reference Comment
Tfus321.KN/ASondheimer, Amiel, et al., 1959Uncertainty assigned by TRC = 3. K
Tfus321.KN/ASondheimer, Amiel, et al., 1957Uncertainty assigned by TRC = 4. K

In addition to the Thermodynamics Research Center (TRC) data available from this site, much more physical and chemical property data is available from the following TRC products:

References

Sondheimer, Amiel, et al., 1959
Sondheimer, F.; Amiel, Y.; Wolovsky, R., Unsaturated Macrocyclic Compounds VIII. Oxidation of Terminal Diacetylenes Five New Macrocyclic Rings, J. Am. Chem. Soc., 1959, 81, 4600-6. [all data]

Sondheimer, Amiel, et al., 1957
Sondheimer, F.; Amiel, Y.; Wolovsky, R., Unsaturated Macrocyclic Compounds V. Large Ring Poly-acetylenes, J. Am. Chem. Soc., 1957, 79, 4247-8. [all data]