2-Methylene-bicyclo[2.2.2]-octane

Condensed phase thermochemistry data

Data compiled by: Hussein Y. Afeefy, Joel F. Liebman, and Stephen E. Stein

Quantity Value Units Method Reference Comment
Δfliquid-54.4 ± 2.5kJ/molCmKozina, Bychikhina, et al., 1974
Quantity Value Units Method Reference Comment
Δcliquid-5488.0 ± 2.4kJ/molCmKozina, Bychikhina, et al., 1974Corresponding Δfliquid = -54.43 kJ/mol (simple calculation by NIST; no Washburn corrections)

Gas phase thermochemistry data

Data compiled by: Hussein Y. Afeefy, Joel F. Liebman, and Stephen E. Stein

Quantity Value Units Method Reference Comment
Δfgas-2.21kcal/molCmKozina, Bychikhina, et al., 1974

Phase change data

Data compiled as indicated in comments:
ALS - Hussein Y. Afeefy, Joel F. Liebman, and Stephen E. Stein
DRB - Donald R. Burgess, Jr.

Quantity Value Units Method Reference Comment
Δvap10.80kcal/molVKozina, Bychikhina, et al., 1974ALS
Δvap10.8kcal/molN/AKozina, Bychikhina, et al., 1974DRB

References

Kozina, Bychikhina, et al., 1974
Kozina, M.P.; Bychikhina, L.V.; Gal'chenko, G.L.; Kalinichenko, A.N.; Bobyleva, A.A.; Belikova, N.A.; Plate, A.F., Enthalpies of combustion and formation of 2-methylenebicyclo-[2,2,2]octane and 2-methylbicylo-[2,2,2]oct-2-ene, Russ. J. Phys. Chem. (Engl. Transl.), 1974, 48, 1226-1227. [all data]