trans-Sabinol

Normal alkane RI, non-polar column, custom temperature program

Data compiled by: NIST Mass Spectrometry Data Center, William E. Wallace, director

Column type CapillaryCapillaryCapillaryCapillaryCapillary
Active phase Methyl SiliconeOV-1CP Sil 8 CBSE-30CP Sil 5 CB
Column length (m)  30.50. 25.
Carrier gas  HeHe He
Substrate
Column diameter (mm)  0.250.32
Phase thickness (μm)  0.250.25 0.39
Program not specified45 0C (4 min) 3 0C/min -> 75 0C 4 0C/min -> 115 0C 6 0C/min -> 312 0C60C(2min) => 5C/min => 160C(1min) => 10C/min => 250C (5min)not specifiednot specified
I 1136.1119.1140.1134.1132.
ReferenceCouladis, Özcan, et al., 2004Hafez and Abdel-Salam, 2004Judpentienë and Mockutë, 2004Vinogradov, 2004Weyerstahl, Marschall, et al., 1998
Comment MSDC-RI MSDC-RI MSDC-RI MSDC-RI MSDC-RI
Column type Capillary
Active phase Polydimethyl siloxanes
Column length (m)
Carrier gas
Substrate
Column diameter (mm)
Phase thickness (μm)
Program not specified
I 1134.
ReferenceZenkevich, 1997
Comment MSDC-RI

Van Den Dool and Kratz RI, polar column, temperature ramp

Data compiled by: NIST Mass Spectrometry Data Center, William E. Wallace, director

Column type Capillary
Active phase Carbowax 20M
Column length (m) 25.
Carrier gas H2
Substrate
Column diameter (mm) 0.25
Phase thickness (μm) 0.3
Tstart (C) 50.
Tend (C) 200.
Heat rate (K/min) 3.
Initial hold (min) 1.
Final hold (min) 20.
I 1708.
ReferenceBicchi, Rubiolo, et al., 1998
Comment MSDC-RI

References

Couladis, Özcan, et al., 2004
Couladis, M.; Özcan, M.; Tzakou, O.; Akgül, A., Menengic (Pistacia terebinthus L.) agacinin degisik organlarinda ucucu yag bilesimi, Bitkisel Ilac Hammaddeleri Toplantisi, Bildiriler, 29-31 Mayis 2002, 2004, 6. [all data]

Hafez and Abdel-Salam, 2004
Hafez, S.S.; Abdel-Salam, H.A., chemical composition and antimicrobial activity of the volatile constituents of thuja occidentalis L. growing in Egipt, Alexandria J. Pharm. Sci., 2004, 18, 1, 41-47. [all data]

Judpentienë and Mockutë, 2004
Judpentienë, A.; Mockutë, D., Chemical composition of essential oils of Artemisia absinthium L. (wormwood) growing wild in Vilnius, Chemija, 2004, 15, 4, 64-68. [all data]

Vinogradov, 2004
Vinogradov, B.A., Production, composition, properties and application of essential oils, 2004, retrieved from http://viness.narod.ru. [all data]

Weyerstahl, Marschall, et al., 1998
Weyerstahl, P.; Marschall, H.; Weirauch, M.; Thefeld, K.; Surburg, H., Constituents of commercial Labdanum oil, Flavour Fragr. J., 1998, 13, 5, 295-318, https://doi.org/10.1002/(SICI)1099-1026(1998090)13:5<295::AID-FFJ751>3.0.CO;2-I . [all data]

Zenkevich, 1997
Zenkevich, I.G., Analytical Parameters of Components of Essential Oils for their Chromatographic and Chromato-Spectral Identificaiton. Oxsigenated derivatives of Mono- and Sesquiterpene Hydrocarbons, Rastit, Resursy (Rus.), 1997, 33, 1, 16-28. [all data]