Naphthalene, decahydro-2-methyl-

Kovats' RI, non-polar column, isothermal

View large format table.

Column type Active phase Temperature (C) I Reference Comment
PackedOV-101120.1159.Litvinenko, Isakova, et al., 1988He, Chromaton W AW; Column length: 2.4 m
CapillarySE-30110.1122.Bredael, 1982Column length: 100. m; Column diameter: 0.5 mm
CapillarySE-30130.1133.Bredael, 1982Column length: 100. m; Column diameter: 0.5 mm
CapillarySE-30150.1145.Bredael, 1982Column length: 100. m; Column diameter: 0.5 mm
CapillarySE-30110.1142.Bredael, 1982Column length: 100. m; Column diameter: 0.5 mm
CapillarySE-30130.1153.Bredael, 1982Column length: 100. m; Column diameter: 0.5 mm
CapillarySE-30150.1166.Bredael, 1982Column length: 100. m; Column diameter: 0.5 mm
CapillarySE-30110.1154.Bredael, 1982Column length: 100. m; Column diameter: 0.5 mm
CapillarySE-30130.1167.Bredael, 1982Column length: 100. m; Column diameter: 0.5 mm
CapillarySE-30150.1180.Bredael, 1982Column length: 100. m; Column diameter: 0.5 mm
CapillarySE-30110.1160.Bredael, 1982Column length: 100. m; Column diameter: 0.5 mm
CapillarySE-30130.1173.Bredael, 1982Column length: 100. m; Column diameter: 0.5 mm
CapillarySE-30150.1186.Bredael, 1982Column length: 100. m; Column diameter: 0.5 mm

Kovats' RI, non-polar column, temperature ramp

View large format table.

Column type Active phase I Reference Comment
CapillarySE-541115.Rembold, Wallner, et al., 198930. m/0.25 mm/0.25 μm, He, 0. C @ 12. min, 12. K/min; Tend: 250. C

Van Den Dool and Kratz RI, non-polar column, custom temperature program

View large format table.

Column type Active phase I Reference Comment
CapillaryDB-5MS1146.Selli, Rannou, et al., 200630. m/0.32 mm/0.5 μm, He; Program: 50C => 5C/min => 200C => 8C/min => 260C(5min)

References

Litvinenko, Isakova, et al., 1988
Litvinenko, G.S.; Isakova, L.A.; Rubanyk, N.N., Quantitative correlation between structure of stereoisomeric saturated cyclic compounds and gas-chromatographic retention indices. I. Methysubstituted, Izv. AN Kaz. SSR, Ser. Khim., 1988, 5, 54-66. [all data]

Bredael, 1982
Bredael, P., Retention indices of hydrocarbons on SE-30, J. Hi. Res. Chromatogr. Chromatogr. Comm., 1982, 5, 6, 325-328, https://doi.org/10.1002/jhrc.1240050610 . [all data]

Rembold, Wallner, et al., 1989
Rembold, H.; Wallner, P.; Nitz, S.; Kollmannsberger, H.; Drawert, F., Volatile components of chickpea (Cicer arietinum L.) seed, J. Agric. Food Chem., 1989, 37, 3, 659-662, https://doi.org/10.1021/jf00087a018 . [all data]

Selli, Rannou, et al., 2006
Selli, S.; Rannou, C.; Prost, C.; Robin, J.; Serot, T., Characterization of Aroma-Active Compounds in Rainbow Trout (Oncorhynchus mykiss) Eliciting an Off-Odor, J. Agric. Food Chem., 2006, 54, 25, 9496-9502, https://doi.org/10.1021/jf0619582 . [all data]