2-(1-Methylpropyl)pyrazine

Normal alkane RI, non-polar column, temperature ramp

Data compiled by: NIST Mass Spectrometry Data Center, William E. Wallace, director

Column type CapillaryCapillary
Active phase OV-101OV-101
Column length (m) 50.50.
Carrier gas N2N2
Substrate
Column diameter (mm) 0.220.22
Phase thickness (μm)
Tstart (C) 80.80.
Tend (C) 200.200.
Heat rate (K/min) 2.2.
Initial hold (min)
Final hold (min)
I 1040.1040.
ReferenceMihara and Masuda, 1987Masuda and Mihara, 1986
Comment MSDC-RI MSDC-RI

References

Mihara and Masuda, 1987
Mihara, S.; Masuda, H., Correlation between molecular structures and retention indices of pyrazines, J. Chromatogr., 1987, 402, 309-317, https://doi.org/10.1016/0021-9673(87)80029-8 . [all data]

Masuda and Mihara, 1986
Masuda, H.; Mihara, S., Use of modified molecular connectivity indices to predict retention indices of monosubstituted alkyl, alkoxy, alkylthio, phenoxy and (phenylthio)pyrazines, J. Chromatogr., 1986, 366, 373-377, https://doi.org/10.1016/S0021-9673(01)93485-5 . [all data]