Bicyclo[3.3.3]undecane

Phase change data

Data compiled as indicated in comments:
ALS - Hussein Y. Afeefy, Joel F. Liebman, and Stephen E. Stein
DRB - Donald R. Burgess, Jr.
DH - Eugene S. Domalski and Elizabeth D. Hearing

Quantity Value Units Method Reference Comment
Δsub63.60 ± 0.84kJ/molCParker, Steele, et al., 1975ALS
Δsub63.5kJ/molN/AParker, Steele, et al., 1975DRB

Enthalpy of sublimation

ΔsubH (kJ/mol) Temperature (K) Reference Comment
6.3597298.15Parker, Steele, et al., 1975DH

Entropy of sublimation

ΔsubS (J/mol*K) Temperature (K) Reference Comment
21.33298.15Parker, Steele, et al., 1975DH

References

Parker, Steele, et al., 1975
Parker, W.; Steele, W.V.; Stirling, W.; Watt, I., A high-precision aneroid static-bomb combustion calorimeter for samples of about 20 mg. The standard enthalpy of formation of bicyclo[3.3.3]undecane, J. Chem. Thermodyn., 1975, 7, 795-802. [all data]