3,3,7,7-Tetramethyl-1,5-diazabicyclo[3.3.0]octane

Gas phase ion energetics data

Data compiled as indicated in comments:
LBLHLM - Sharon G. Lias, John E. Bartmess, Joel F. Liebman, John L. Holmes, Rhoda D. Levin, and W. Gary Mallard
LLK - Sharon G. Lias, Rhoda D. Levin, and Sherif A. Kafafi

Ionization energy determinations

IE (eV) Method Reference Comment
8.64PENelsen, 1984Vertical value; LBLHLM
7.53PENelsen, Peacock, et al., 1976Vertical value; LLK
7.53PENelsen and Buschek, 1974Vertical value; LLK

References

Nelsen, 1984
Nelsen, S.F., Ionization from nitrogen and oxygen lone pairs: A comparison of trialkylamine, dialkyl ether, tetraalkylhydrazine, and dialkyl peroxide photoelectron spectroscopic ionization potentials, J. Org. Chem., 1984, 49, 1891. [all data]

Nelsen, Peacock, et al., 1976
Nelsen, S.F.; Peacock, V.; Weisman, G.R., Single-electron oxidation equilibria of tetraalkylhydrazines. Comparison of solution E° values and vapor-phase ionization potentials, J. Am. Chem. Soc., 1976, 98, 5269. [all data]

Nelsen and Buschek, 1974
Nelsen, S.F.; Buschek, J.M., Photoelectron spectra of hydrazines. V. Pyrazolidine and hexahydropyridazine derivatives, J. Am. Chem. Soc., 1974, 96, 6987. [all data]