Aluminum, iododimethyl-

Gas phase ion energetics data

Data compiled by: Sharon G. Lias, Rhoda D. Levin, and Sherif A. Kafafi

Ionization energy determinations

IE (eV) Method Reference Comment
9.48PEBarker, Lappert, et al., 1975Vertical value

References

Barker, Lappert, et al., 1975
Barker, G.K.; Lappert, M.F.; Pedley, J.B.; Sharp, G.J.; Westwood, N.P.C., Bonding studies of boron and the group 3-5 elements. Part XV. He(I) photoelectron spectra of monomeric group 3 tri-halide, trimethyl, and mixed halogenomethyl species, J. Chem. Soc. Dalton Trans., 1975, 1765. [all data]