7-phenylquinoline

Phase change data

Data compiled by: Thermodynamics Research Center, NIST Boulder Laboratories, Chris Muzny director

Quantity Value Units Method Reference Comment
Tfus332.65KN/ACumper, Ginman, et al., 1962Uncertainty assigned by TRC = 2. K

In addition to the Thermodynamics Research Center (TRC) data available from this site, much more physical and chemical property data is available from the following TRC products:

References

Cumper, Ginman, et al., 1962
Cumper, C.W.N.; Ginman, R.F.A.; Vogel, A.I., Physical properties and chemical constitution. The electric dipole moments of phenyl derivatives of some n-heterocyclic molecules, J. Chem. Soc., 1962, 1962, 4518. [all data]