(2-Hydroxy-4,6-dimethylphenyl)phenylmethanone

Phase change data

Data compiled as indicated in comments:
TRC - Thermodynamics Research Center, NIST Boulder Laboratories, Chris Muzny director
AC - William E. Acree, Jr., James S. Chickos

Quantity Value Units Method Reference Comment
Tfus405.KN/ASalman and Abas, 1989Uncertainty assigned by TRC = 3. K; TRC

Enthalpy of fusion

ΔfusH (kcal/mol) Temperature (K) Method Reference Comment
0.16405.2DTASalman and Abas, 1989, 2Reported enthalpy of fusion is too small, and the published enthalpy and entropy of fusion data are internally inconsistent; AC

In addition to the Thermodynamics Research Center (TRC) data available from this site, much more physical and chemical property data is available from the following TRC products:

References

Salman and Abas, 1989
Salman, S.R.; Abas, K.F., Thermochim. Acta, 1989, 381. [all data]

Salman and Abas, 1989, 2
Salman, Salman R.; Abas, Kafaa P., Effect of hydrogen bonding on the thermal behaviour of substituted phenols, Thermochimica Acta, 1989, 152, 2, 381-386, https://doi.org/10.1016/0040-6031(89)85406-1 . [all data]