1,2,4,6-Tetrathiepane

Van Den Dool and Kratz RI, non-polar column, temperature ramp

View large format table.

Column type Active phase I Reference Comment
CapillaryOV-11477.Chen and Ho, 1986H2, 4. K/min, 280. C @ 50. min; Column length: 50. m; Column diameter: 0.2 mm; Tstart: 50. C

Normal alkane RI, non-polar column, temperature ramp

View large format table.

Column type Active phase I Reference Comment
CapillarySPB-11489.Frerot, Velluz, et al., 200830. m/0.25 mm/1.0 μm, Helium, 60. C @ 5. min, 5. K/min; Tend: 250. C

Normal alkane RI, polar column, custom temperature program

View large format table.

Column type Active phase I Reference Comment
CapillaryEC-10002420.Delabre and Bendall, 9999Program: not specified

References

Chen and Ho, 1986
Chen, C.-C.; Ho, C.-T., Identification of sulfurous compounds of shiitake mushroom (Lentinus edodes Sing.), J. Agric. Food Chem., 1986, 34, 5, 830-833, https://doi.org/10.1021/jf00071a016 . [all data]

Frerot, Velluz, et al., 2008
Frerot, E.; Velluz, A.; Bagnoud, A.; Delort, E., Analysis of the volatile constituents of cooked petai beans (Parkia speciosa) using high-resolution GC/TOF-MS, Flav. Fragr. J., 2008, 23, 6, 434-440, https://doi.org/10.1002/ffj.1902 . [all data]

Delabre and Bendall, 9999
Delabre, M.-L.; Bendall, J.F., Flavour ingredients from fermented dairy streams, Expression of Multidisciplinary Flavour Sci., 9999, 375-378. [all data]