2-Heptadecanone

Normal alkane RI, non-polar column, temperature ramp

Data compiled by: NIST Mass Spectrometry Data Center, William E. Wallace, director

Column type CapillaryCapillaryCapillaryCapillaryCapillary
Active phase HP-5 MS5 % Phenyl methyl siloxaneDB-5Optima-1Ultra-2
Column length (m) 30.0.30.25.50.
Carrier gas HeliumHeH2HeHe
Substrate
Column diameter (mm) 0.250.250.250.200.32
Phase thickness (μm) 0.251.0.250.250.52
Tstart (C) 35.40.60.50.40.
Tend (C) 195.250.280.250.250.
Heat rate (K/min) 2.7.4.3.4.
Initial hold (min) 5.10.10.3.3.
Final hold (min) 30.5.40. 30.
I 1899.1910.1892.1887.1906.
ReferenceKim and Chung, 2009Ramírez, Estévez, et al., 2004Pino, Marbot, et al., 2003de Beck, Bessière, et al., 2000King, Matthews, et al., 1995
Comment MSDC-RI MSDC-RI MSDC-RI MSDC-RI MSDC-RI
Column type CapillaryCapillaryCapillaryCapillaryCapillary
Active phase Cross-Linked MethylsiliconeDB-1DB-1Ultra-1OV-101
Column length (m) 25.30.30.25.54.
Carrier gas HeHeHeHeHelium
Substrate
Column diameter (mm) 0.320.250.250.320.26
Phase thickness (μm)  0.250.250.25
Tstart (C) 35.50.50.80.50.
Tend (C) 225.240.240.260.240.
Heat rate (K/min) 4.5.5.3.5.
Initial hold (min) 3.3.3. 0.
Final hold (min)     0.
I 1883.1875.1884.1881.1891.
ReferenceBravo and Hotchkiss, 1993Shiota, 1993Shiota, 1993Okumura, 1991Zenkevich and Ventura, 1991
Comment MSDC-RI MSDC-RI MSDC-RI MSDC-RI MSDC-RI

Van Den Dool and Kratz RI, polar column, temperature ramp

Data compiled by: NIST Mass Spectrometry Data Center, William E. Wallace, director

Column type CapillaryCapillaryCapillaryCapillaryCapillary
Active phase ZB-WaxZB-WaxCP-Wax 52CBSupelcowax-10DB-Wax
Column length (m) 30.30.50.60.60.
Carrier gas HeHeH2HeHe
Substrate
Column diameter (mm) 0.250.250.320.250.25
Phase thickness (μm) 0.150.15 0.250.25
Tstart (C) 35.35.50.35.50.
Tend (C) 220.220.200.195.230.
Heat rate (K/min) 5.5.2.2.2.
Initial hold (min) 5.5. 5.
Final hold (min) 10.10. 90.60.
I 2231.2220.2218.2243.2255.
ReferenceLedauphin, Basset, et al., 2006Ledauphin, Saint-Clair, et al., 2004Liu, Yang, et al., 2001Chung, 1999Shiratsuchi, Shimoda, et al., 1994
Comment MSDC-RI MSDC-RI MSDC-RI MSDC-RI MSDC-RI

Kovats' RI, non-polar column, temperature ramp

Data compiled by: NIST Mass Spectrometry Data Center, William E. Wallace, director

Column type CapillaryCapillaryCapillaryCapillaryCapillary
Active phase BP-1BP-1DB-1OV-101OV-101
Column length (m) 30.30.60.50.50.
Carrier gas N2N2
Substrate
Column diameter (mm) 0.320.320.250.230.23
Phase thickness (μm) 0.250.250.25
Tstart (C) 60.60.30.80.80.
Tend (C) 220.220.220.200.200.
Heat rate (K/min) 5.5.2.2.2.
Initial hold (min)   4.
Final hold (min) 3.13.
I 1883.1890.1882.1881.1883.
ReferenceSrivastava, Srivastava, et al., 2006Shawl, Srivastava, et al., 2002Takeoka, Perrino, et al., 1996Ohnishi and Shibamoto, 1984Ohnishi and Shibamoto, 1984
Comment MSDC-RI MSDC-RI MSDC-RI MSDC-RI MSDC-RI

Lee's RI, non-polar column, temperature ramp

Data compiled by: NIST Mass Spectrometry Data Center, William E. Wallace, director

Column type Capillary
Active phase DB-5
Column length (m) 30.
Carrier gas He
Substrate
Column diameter (mm) 0.26
Phase thickness (μm) 0.25
Tstart (C) 50.
Tend (C) 300.
Heat rate (K/min) 6.
Initial hold (min) 4.
Final hold (min) 20.
I 317.70
ReferenceRostad and Pereira, 1986
Comment MSDC-RI

Van Den Dool and Kratz RI, non-polar column, custom temperature program

Data compiled by: NIST Mass Spectrometry Data Center, William E. Wallace, director

Column type Capillary
Active phase DB-5
Column length (m) 30.
Carrier gas H2
Substrate
Column diameter (mm) 0.25
Phase thickness (μm) 0.25
Program 40C(5min) => 2C/min => 220C => 5C/min => 250C(15min)
I 1906.
ReferenceBoulanger, Chassagne, et al., 1999
Comment MSDC-RI

Phase change data

Data compiled by: William E. Acree, Jr., James S. Chickos

Enthalpy of vaporization

ΔvapH (kJ/mol) Temperature (K) Method Reference Comment
77.0417.AStephenson and Malanowski, 1987Based on data from 402. - 593. K. See also Stull, 1947.

Normal alkane RI, non-polar column, custom temperature program

Data compiled by: NIST Mass Spectrometry Data Center, William E. Wallace, director

Column type CapillaryCapillaryCapillaryCapillaryCapillary
Active phase BPX-5Polydimethyl siloxane with 5 % Ph groupsHP-5MSBPX-5CP Sil 5 CB
Column length (m) 30. 30.50.25.
Carrier gas Helium HeHeliumN2
Substrate
Column diameter (mm) 0.25 0.250.32
Phase thickness (μm) 0.25 0.250.500.39
Program not specifiednot specified40C (10min) => 3C/min => 120C => 10C/min => 250C (5min)40 0C (5 min) 20 0C/min -> 60 0C (5 min) 4 0C/min -> 250 0C (10 min)not specified
I 1906.1892.1897.1909.1876.
Referencese Souza, Cardeal, et al., 2009Pino, Marbot, et al., 2005Ansorena, Gimeno, et al., 2001Madruga, Arruda, et al., 2000Weyerstahl, Marschall, et al., 1998
Comment MSDC-RI MSDC-RI MSDC-RI MSDC-RI MSDC-RI
Column type CapillaryCapillary
Active phase SE-54SE-54
Column length (m) 50.50.
Carrier gas He
Substrate
Column diameter (mm) 0.320.32
Phase thickness (μm)
Program 35 0C (5 min) 8 0C/min -> 200 0C 2 0C/min -> 250 0C35C(5min) => 8C/min => 200C => 2C/min => 250C
I 1910.1910.
ReferenceUm, Bailey, et al., 1992Suzuki and Bailey, 1985
Comment MSDC-RI MSDC-RI

Kovats' RI, non-polar column, isothermal

Data compiled by: NIST Mass Spectrometry Data Center, William E. Wallace, director

Column type PackedCapillaryCapillary
Active phase OV-101SE-30SE-30
Column length (m) 2.27.27.
Carrier gas N2N2N2
Substrate Chromosorb G HPChromosorb G HPChromosorb G HP
Column diameter (mm)  0.40.4
Phase thickness (μm)  1.130.1
Temperature (C) 220.220.200.
I 1891.11886.81887.5
ReferenceDidaoui, Touabet, et al., 1997Didaoui, Touabet, et al., 1997Didaoui, Touabet, et al., 1997
Comment MSDC-RI MSDC-RI MSDC-RI

References

Kim and Chung, 2009
Kim, J.-S.; Chung, H.Y., GC-MS analysis of the volatile components in dried boxthorn (Lycium chimensis) Fruit, J. Korean Soc. Appl. Biol. Chem., 2009, 52, 5, 516-524, https://doi.org/10.3839/jksabc.2009.088 . [all data]

Ramírez, Estévez, et al., 2004
Ramírez, M.R.; Estévez, M.; Morcuende, D.; Cava, R., Effect of the type of frying culinary fat on volatile compounds isolated in fried pork loin chops by using SPME-GC-MS, J. Agric. Food Chem., 2004, 52, 25, 7637-7643, https://doi.org/10.1021/jf049207s . [all data]

Pino, Marbot, et al., 2003
Pino, J.A.; Marbot, R.; Fuentes, V., Characterization of volatiles in Bullock's heart (Annona reticulata L.) fruit cultivars from Cuba, J. Agric. Food Chem., 2003, 51, 13, 3836-3839, https://doi.org/10.1021/jf020733y . [all data]

de Beck, Bessière, et al., 2000
de Beck, P.O.; Bessière, J.M.; Dijoux-Franca, M.-G.; David, B.; Mariotte, A.-M., Volatile constituents from leaves and wood of Leea guineensis G. Don (Leeaceae) from Cameroon, Flavour Fragr. J., 2000, 15, 3, 182-185, https://doi.org/10.1002/1099-1026(200005/06)15:3<182::AID-FFJ888>3.0.CO;2-X . [all data]

King, Matthews, et al., 1995
King, M.-F.; Matthews, M.A.; Rule, D.C.; Field, R.A., Effect of beef packaging method on volatile compounds developed by oven roasting or microwave cooking, J. Agric. Food Chem., 1995, 43, 3, 773-778, https://doi.org/10.1021/jf00051a039 . [all data]

Bravo and Hotchkiss, 1993
Bravo, A.; Hotchkiss, J.H., Identification of volatile compounds resulting from the thermal oxidation of polyethylene, J. Appl. Polym. Sci., 1993, 47, 10, 1741-1748, https://doi.org/10.1002/app.1993.070471004 . [all data]

Shiota, 1993
Shiota, H., New esteric components in the volatiles of banana fruit (Musa sapientum L.), J. Agric. Food Chem., 1993, 41, 11, 2056-2062, https://doi.org/10.1021/jf00035a046 . [all data]

Okumura, 1991
Okumura, T., retention indices of environmental chemicals on methyl silicone capillary column, Journal of Environmental Chemistry (Japan), 1991, 1, 2, 333-358, https://doi.org/10.5985/jec.1.333 . [all data]

Zenkevich and Ventura, 1991
Zenkevich, I.G.; Ventura, K., Gas Chromatographic Identification of Volatile Products of Thermal Degradation of Bitumen, Zh. Prikl. Khim. (Rus.), 1991, 9, 1974-1979. [all data]