1-Hexadecyn-3-ol, 3,7,11,15-tetramethyl-

Condensed phase thermochemistry data

Data compiled as indicated in comments:
ALS - Hussein Y. Afeefy, Joel F. Liebman, and Stephen E. Stein
DH - Eugene S. Domalski and Elizabeth D. Hearing

Quantity Value Units Method Reference Comment
Δfliquid-105.42 ± 0.29kcal/molCcbGadzhiev, Gubareva, et al., 1983Author's hf298_condensed=-440.07; ALS
Δfliquid-103.0 ± 3.3kcal/molCcbGadzhiev, Kerimov, et al., 1982%hf_298 calculated possible error by the author; ALS
Δfliquid-103.0 ± 3.3kcal/molCcbGadzhiev, Kerimov, et al., 1982Author's hf298_condensed=-440.1±13.8 kJ/mol; ALS
Quantity Value Units Method Reference Comment
Δcliquid-3073.6 ± 1.1kcal/molCcbGadzhiev, Gubareva, et al., 1983Author's hf298_condensed=-440.07; Corresponding Δfliquid = -105.40 kcal/mol (simple calculation by NIST; no Washburn corrections); ALS
Δcliquid-3075.98kcal/molCcbGadzhiev, Kerimov, et al., 1982%hf_298 calculated possible error by the author; Corresponding Δfliquid = -103.0 kcal/mol (simple calculation by NIST; no Washburn corrections); ALS
Δcliquid-3076.0 ± 3.3kcal/molCcbGadzhiev, Kerimov, et al., 1982Author's hf298_condensed=-440.1±13.8 kJ/mol; Corresponding Δfliquid = -103.0 kcal/mol (simple calculation by NIST; no Washburn corrections); ALS

Constant pressure heat capacity of liquid

Cp,liquid (cal/mol*K) Temperature (K) Reference Comment
170.3293.85Baglay, Gurariy, et al., 1988T = 270 to 340 K. Unsmoothed experimental datum.; DH

References

Gadzhiev, Gubareva, et al., 1983
Gadzhiev, S.N.; Gubareva, A.I.; Ignat'ev, V.L.; Malinina, A.T.; Shakhova, M.K., Thermochemical study of intermediates from the synthesis of vitamin E, Deposited Document, SPSTL 448 Khp-D81. Chem. Abst. 98:88660x, 1983, 1. [all data]

Gadzhiev, Kerimov, et al., 1982
Gadzhiev, S.N.; Kerimov, K.K.; Gubareva, A.I.; Beregovykh, V.V.; Ignat'ev, V.L.; Nurullaev, G.G., Study of the physicochemical properties of polyene compounds and their derivatives, Khim.-Farm. Zh., 1982, 16, 1131-1133. [all data]

Baglay, Gurariy, et al., 1988
Baglay, A.K.; Gurariy, L.L.; Kuleshov, G.G., Physical properties of compounds used in vitamin synthesis, J. Chem. Eng. Data, 1988, 33, 512-518. [all data]