Cycloheptane
- Formula: C7H14
- Molecular weight: 98.1861
- IUPAC Standard InChIKey: DMEGYFMYUHOHGS-UHFFFAOYSA-N
- CAS Registry Number: 291-64-5
- Chemical structure:

Gas phase thermochemistry data

Data compiled by: Glushko Thermocenter, Russian Academy of Sciences, Moscow
Quantity | Value | Units | Method | Reference | Comment |
---|---|---|---|---|---|
S°gas | 342.3 ± 1.3 | J/mol*K | N/A | Finke H.L., 1956 |
Constant pressure heat capacity of gas
Cp,gas (J/mol*K) | Temperature (K) | Reference | Comment |
---|---|---|---|
37.94 | 50. | Dorofeeva O.V., 1986 | Discrepancies between recommended Cp(T) values and those calculated by molecular mechanics method [ Chang S., 1970] amount to 3.6-7.7 J/mol*K; discrepancies in S(T) values increase at high temperatures up to 2.3 J/mol*K for 500 K. |
52.13 | 100. | ||
68.39 | 150. | ||
86.84 | 200. | ||
119.63 | 273.15 | ||
132.0 ± 3.5 | 298.15 | ||
132.94 | 300. | ||
183.23 | 400. | ||
228.47 | 500. | ||
266.45 | 600. | ||
298.03 | 700. | ||
324.49 | 800. | ||
346.86 | 900. | ||
365.89 | 1000. | ||
382.13 | 1100. | ||
396.04 | 1200. | ||
407.99 | 1300. | ||
418.28 | 1400. | ||
427.19 | 1500. |

Phase change data

Data compiled as indicated in comments:
BS - Robert L. Brown and Stephen E. Stein
TRC - Thermodynamics Research Center, NIST Boulder Laboratories, Chris Muzny director
AC - William E. Acree, Jr., James S. Chickos
ALS - Hussein Y. Afeefy, Joel F. Liebman, and Stephen E. Stein
CAL - James S. Chickos, William E. Acree, Jr., Joel F. Liebman, Students of Chem 202 (Introduction to the Literature of Chemistry), University of Missouri -- St. Louis
DH - Eugene S. Domalski and Elizabeth D. Hearing
Quantity | Value | Units | Method | Reference | Comment |
---|---|---|---|---|---|
Tboil | 392.0 ± 0.9 | K | AVG | N/A | Average of 8 values; Individual data points |
Quantity | Value | Units | Method | Reference | Comment |
Tfus | 264. ± 3. | K | AVG | N/A | Average of 6 values; Individual data points |
Quantity | Value | Units | Method | Reference | Comment |
Ttriple | 265. | K | N/A | Finke, Scott, et al., 1956 | Crystal phase 1 phase; Uncertainty assigned by TRC = 0.07 K; TRC |
Ttriple | 265.12 | K | N/A | Finke, Scott, et al., 1956 | Crystal phase 1 phase; Uncertainty assigned by TRC = 0.05 K; TRC |
Ttriple | 265.1 | K | N/A | Kaarsemaker, 1951 | Uncertainty assigned by TRC = 3. K; TRC |
Quantity | Value | Units | Method | Reference | Comment |
Tc | 604.2 ± 0.5 | K | N/A | Daubert, 1996 | |
Tc | 604.2 | K | N/A | Hicks and Young, 1971 | Uncertainty assigned by TRC = 0.5 K; TRC |
Quantity | Value | Units | Method | Reference | Comment |
Pc | 38.2 ± 0.4 | bar | N/A | Daubert, 1996 | |
Pc | 38.13 | bar | N/A | Young, 1972 | Uncertainty assigned by TRC = 0.50 bar; TRC |
Pc | 38.26 | bar | N/A | Hicks and Young, 1971 | Uncertainty assigned by TRC = 0.4053 bar; TRC |
Quantity | Value | Units | Method | Reference | Comment |
Vc | 0.353 | l/mol | N/A | Daubert, 1996 | |
Vc | 0.354 | l/mol | N/A | Young, 1972 | Uncertainty assigned by TRC = 0.007 l/mol; TRC |
Quantity | Value | Units | Method | Reference | Comment |
ρc | 2.83 ± 0.04 | mol/l | N/A | Daubert, 1996 | |
Quantity | Value | Units | Method | Reference | Comment |
ΔvapH° | 38.5 | kJ/mol | N/A | Anand, Grolier, et al., 1975 | Based on data from 283. to 323. K.; AC |
ΔvapH° | 38.5 ± 2.1 | kJ/mol | V | Finke, Scott, et al., 1956, 2 | ALS |
ΔvapH° | 38.5 ± 0.2 | kJ/mol | N/A | Finke, Scott, et al., 1956, 3 | AC |
ΔvapH° | 39.4 | kJ/mol | V | Kaarsemaker and Coops, 1952 | ALS |
ΔvapH° | 37. | kJ/mol | E | Spitzer and Huffman, 1947 | ALS |
Enthalpy of vaporization
ΔvapH (kJ/mol) | Temperature (K) | Method | Reference | Comment |
---|---|---|---|---|
38.6 | 297. | A | Stephenson and Malanowski, 1987 | Based on data from 282. to 333. K.; AC |
31.7 | 491. | A | Stephenson and Malanowski, 1987 | Based on data from 476. to 604. K.; AC |
36.4 | 348. | A,EB | Stephenson and Malanowski, 1987 | Based on data from 333. to 398. K. See also Meyer and Hotz, 1976.; AC |
36.1 | 356. | A,EB | Stephenson and Malanowski, 1987 | Based on data from 341. to 433. K. See also Finke, Scott, et al., 1956, 3.; AC |
Antoine Equation Parameters
log10(P) = A − (B / (T + C))
P = vapor pressure (bar)
T = temperature (K)
View plot Requires a JavaScript / HTML 5 canvas capable browser.
Temperature (K) | A | B | C | Reference | Comment |
---|---|---|---|---|---|
341.3 to 432.17 | 3.9771 | 1330.402 | -56.946 | Finke, Scott, et al., 1956, 3 | Coefficents calculated by NIST from author's data. |
Enthalpy of sublimation
ΔsubH (kJ/mol) | Temperature (K) | Reference | Comment |
---|---|---|---|
53.5 | 134. | Bondi, 1963 | AC |
Enthalpy of fusion
ΔfusH (kJ/mol) | Temperature (K) | Reference | Comment |
---|---|---|---|
1.88 | 265.1 | Domalski and Hearing, 1996 | AC |
Entropy of fusion
ΔfusS (J/mol*K) | Temperature (K) | Reference | Comment |
---|---|---|---|
36.94 | 134.8 | Domalski and Hearing, 1996 | CAL |
1.46 | 198.2 | ||
2.11 | 212.4 | ||
7.1 | 265.1 |
Temperature of phase transition
Ttrs (K) | Initial Phase | Final Phase | Reference | Comment |
---|---|---|---|---|
135.7 | crystaline, IV | crystaline, III | Haines and Gilson, 1990 | DH |
206.3 | crystaline, III | crystaline, I | Haines and Gilson, 1990 | Overlap of the III to II and the II to I transitions.; DH |
Enthalpy of phase transition
ΔHtrs (kJ/mol) | Temperature (K) | Initial Phase | Final Phase | Reference | Comment |
---|---|---|---|---|---|
4.9664 | 134.8 | crystaline, IV | crystaline, III | Finke, Scott, et al., 1956, 3 | DH |
0.2895 | 198.2 | crystaline, III | crystaline, II | Finke, Scott, et al., 1956, 3 | DH |
0.4498 | 212.4 | crystaline, II | crystaline, I | Finke, Scott, et al., 1956, 3 | DH |
1.8820 | 265.12 | crystaline, I | liquid | Finke, Scott, et al., 1956, 3 | DH |
Entropy of phase transition
ΔStrs (J/mol*K) | Temperature (K) | Initial Phase | Final Phase | Reference | Comment |
---|---|---|---|---|---|
36.84 | 134.8 | crystaline, IV | crystaline, III | Finke, Scott, et al., 1956, 3 | DH |
1.46 | 198.2 | crystaline, III | crystaline, II | Finke, Scott, et al., 1956, 3 | DH |
2.12 | 212.4 | crystaline, II | crystaline, I | Finke, Scott, et al., 1956, 3 | DH |
7.10 | 265.12 | crystaline, I | liquid | Finke, Scott, et al., 1956, 3 | DH |

Kovats' RI, non-polar column, isothermal

Column type | Active phase | Temperature (C) | I | Reference | Comment |
---|---|---|---|---|---|
Packed | C78, Branched paraffin | 130. | 837.5 | Dallos, Sisak, et al., 2000 | He; Column length: 3.3 m |
Packed | C78, Branched paraffin | 130. | 836.0 | Reddy, Dutoit, et al., 1992 | Chromosorb G HP; Column length: 3.3 m |
Packed | Apolane | 130. | 837. | Dutoit, 1991 | Column length: 3.7 m |
Capillary | Squalane | 50. | 794.2 | Lunskii and Paizanskaya, 1988 | He; Column length: 50. m; Column diameter: 0.22 mm |
Capillary | Squalane | 70. | 800. | Lunskii and Paizanskaya, 1988 | He; Column length: 50. m; Column diameter: 0.22 mm |
Capillary | OV-1 | 100. | 806.9 | Engewald, Billing, et al., 1987 | Column length: 50. m; Column diameter: 0.3 mm |
Capillary | SE-30 | 130. | 819. | Bredael, 1982 | Column length: 100. m; Column diameter: 0.5 mm |
Capillary | SE-30 | 80. | 800. | Bredael, 1982 | Column length: 100. m; Column diameter: 0.5 mm |
Capillary | OV-101 | 50. | 789. | Johansen and Ettre, 1982 | 100. m/0.27 mm/0.20 μm |
Capillary | OV-101 | 50. | 788. | Johansen and Ettre, 1982 | 55. m/0.27 mm/0.9 μm |
Capillary | SF-96 | 50. | 789. | Johansen and Ettre, 1982 | 91.4 m/0.31 mm/0.20 μm |
Packed | Squalane | 100. | 815. | Nabivach and Kirilenko, 1980 | He, Chromaton N-AW-HMDS; Column length: 1. m |
Packed | Apolane | 70. | 811.6 | Riedo, Fritz, et al., 1976 | He, Chromosorb; Column length: 2.4 m |
Capillary | Squalane | 42.5 | 791. | Engewald, Epsch, et al., 1974 | N2; Column length: 100. m; Column diameter: 0.23 mm |
Capillary | Squalane | 80. | 804. | Engewald, Epsch, et al., 1974 | N2; Column length: 100. m; Column diameter: 0.23 mm |
Capillary | Squalane | 100. | 811. | Besson and Gäumann, 1973 | Column length: 50. m; Column diameter: 0.25 mm |
Capillary | Apiezon L | 100. | 829. | Besson and Gäumann, 1973 | Column length: 50. m; Column diameter: 0.25 mm |
Capillary | Squalane | 120. | 807. | Agrawal, Tesarík, et al., 1972 | N2, Celite 545; Column length: 50. m; Column diameter: 0.3 mm |
Capillary | Squalane | 86. | 803. | Agrawal, Tesarík, et al., 1972 | N2, Celite 545; Column length: 50. m; Column diameter: 0.3 mm |
Packed | SE-30 | 75. | 784. | Robinson and Odell, 1971 | N2, Chromosorb W; Column length: 6.1 m |
Packed | Squalane | 100. | 812. | Robinson and Odell, 1971 | N2, Embacel; Column length: 3.0 m |
Packed | Squalane | 27. | 786. | Hively and Hinton, 1968 | He, Chromosorb P; Column length: 15. m; Column diameter: 0.25 mm |
Packed | Squalane | 49. | 795. | Hively and Hinton, 1968 | He, Chromosorb P; Column length: 15. m; Column diameter: 0.25 mm |
Packed | Squalane | 67. | 800. | Hively and Hinton, 1968 | He, Chromosorb P; Column length: 15. m; Column diameter: 0.25 mm |
Packed | Squalane | 86. | 806. | Hively and Hinton, 1968 | He, Chromosorb P; Column length: 15. m; Column diameter: 0.25 mm |
Capillary | Squalane | 120. | 816. | Schomburg, 1966 | |
Capillary | Squalane | 80. | 804. | Schomburg, 1966 | |
Packed | Squalane | 150. | 824. | Schomburg, 1964 |

Kovats' RI, non-polar column, temperature ramp

Column type | Active phase | I | Reference | Comment |
---|---|---|---|---|
Capillary | Apiezon L | 819. | Louis, 1971 | N2, 1. K/min; Column length: 50. m; Column diameter: 0.25 mm; Tstart: 60. C |

Van Den Dool and Kratz RI, non-polar column, temperature ramp

Column type | Active phase | I | Reference | Comment |
---|---|---|---|---|
Capillary | Petrocol DH | 787. | White, Hackett, et al., 1992 | 100. m/0.25 mm/0.5 μm, He, 1. K/min; Tstart: 30. C; Tend: 220. C |
Packed | SE-30 | 794. | Buchman, Cao, et al., 1984 | He, Chromosorb AW, 40. C @ 10. min, 10. K/min, 210. C @ 30. min; Column length: 3.05 m |

Van Den Dool and Kratz RI, non-polar column, custom temperature program

Column type | Active phase | I | Reference | Comment |
---|---|---|---|---|
Capillary | DB-1 | 786. | Peng, 2000 | 15. m/0.53 mm/1. μm, He; Program: 40C(3min) => 8C/min => 200(1min) => 5C/min => 300C(25min) |
Packed | SE-30 | 796. | Peng, Ding, et al., 1988 | Supelcoport; Chromosorb; Column length: 3.05 m; Program: 40C(5min) => 10C/min => 200C or 250C (60min) |
Packed | SE-30 | 796. | Peng, Ding, et al., 1988 | Supelcoport; Chromosorb; Column length: 3.05 m; Program: 40C(5min) => 10C/min => 200C or 250C (60min) |

Van Den Dool and Kratz RI, polar column, temperature ramp

Column type | Active phase | I | Reference | Comment |
---|---|---|---|---|
Capillary | DB-Wax | 899. | Peng, 2000 | 15. m/0.53 mm/1. μm, He, 40. C @ 3. min, 5. K/min, 220. C @ 30. min |
Capillary | HP-Wax | 878. | Peng, 2000 | 15. m/0.53 mm/1. μm, He, 40. C @ 3. min, 5. K/min, 220. C @ 30. min |
Packed | Carbowax 20M | 892. | Buchman, Cao, et al., 1984 | He, Supelcoport, 40. C @ 10. min, 10. K/min, 210. C @ 30. min; Column length: 3.05 m |

Normal alkane RI, non-polar column, isothermal

Column type | Active phase | Temperature (C) | I | Reference | Comment |
---|---|---|---|---|---|
Capillary | Methyl Silicone | 50. | 796. | N/A | N2; Column length: 74.6 m; Column diameter: 0.28 mm |

Normal alkane RI, non-polar column, temperature ramp

Column type | Active phase | I | Reference | Comment |
---|---|---|---|---|
Capillary | Petrocol DH | 790. | Supelco, 2012 | 100. m/0.25 mm/0.50 μm, Helium, 20. C @ 15. min, 15. K/min, 220. C @ 30. min |

Normal alkane RI, non-polar column, custom temperature program

Column type | Active phase | I | Reference | Comment |
---|---|---|---|---|
Capillary | Squalane | 800. | Chen, 2008 | Program: not specified |
Capillary | Methyl Silicone | 846. | N/A | Program: not specified |
Capillary | Methyl Silicone | 803. | Zenkevich and Marinichev, 2001 | Program: not specified |
Capillary | OV-1, SE-30, Methyl silicone, SP-2100, OV-101, DB-1, etc. | 797. | Waggott and Davies, 1984 | Hydrogen; Column length: 50. m; Column diameter: 0.32 mm; Program: not specified |
Packed | SE-30 | 807. | Robinson and Odell, 1971 | N2, Chromosorb W; Column length: 6.1 m; Program: 50C910min) => 20C/min => 90(6min) => 10C/min => 150C(hold) |
Packed | Squalane | 800. | Robinson and Odell, 1971 | N2, Embacel; Column length: 3.0 m; Program: 25C(5min) => 2C/min => 35 => 4C/min => 95C(hold) |
Packed | Squalane | 800. | Robinson and Odell, 1971, 2 | Embacel; Column length: 3.0 m; Program: 25C(5min) => 2C/min(5min) => 4C/min(15min) => (hold at 95C) |

Normal alkane RI, polar column, custom temperature program

Column type | Active phase | I | Reference | Comment |
---|---|---|---|---|
Capillary | DB-Wax | 883. | Peng, Yang, et al., 1991 | Program: not specified |

Condensed phase thermochemistry data

Data compiled as indicated in comments:
ALS - Hussein Y. Afeefy, Joel F. Liebman, and Stephen E. Stein
DH - Eugene S. Domalski and Elizabeth D. Hearing
Quantity | Value | Units | Method | Reference | Comment |
---|---|---|---|---|---|
ΔfH°liquid | -156.4 ± 1.7 | kJ/mol | Ccb | Spitzer and Huffman, 1947 | Reanalyzed by Cox and Pilcher, 1970, Original value = -157.9 ± 2.3 kJ/mol; ALS |
Quantity | Value | Units | Method | Reference | Comment |
ΔcH°liquid | -4597.0 ± 0.8 | kJ/mol | Ccb | Kozina, Skuratov, et al., 1961 | Corresponding ΔfHºliquid = -159. kJ/mol (simple calculation by NIST; no Washburn corrections); ALS |
ΔcH°liquid | -4597.6 ± 0.6 | kJ/mol | Ccb | Kaarsemaker and Coops, 1952 | Corresponding ΔfHºliquid = -157.8 kJ/mol (simple calculation by NIST; no Washburn corrections); ALS |
ΔcH°liquid | -4598.9 ± 1.7 | kJ/mol | Ccb | Spitzer and Huffman, 1947 | Reanalyzed by Cox and Pilcher, 1970, Original value = -4598.6 ± 1.7 kJ/mol; Corresponding ΔfHºliquid = -156.4 kJ/mol (simple calculation by NIST; no Washburn corrections); ALS |
ΔcH°liquid | -4586.5 | kJ/mol | Ccb | Zubova, 1901 | Corresponding ΔfHºliquid = -169. kJ/mol (simple calculation by NIST; no Washburn corrections); ALS |
Quantity | Value | Units | Method | Reference | Comment |
S°liquid | 242.55 | J/mol*K | N/A | Finke, Scott, et al., 1956 | DH |
Constant pressure heat capacity of liquid
Cp,liquid (J/mol*K) | Temperature (K) | Reference | Comment |
---|---|---|---|
180.614 | 298.15 | Fortier, D'Arcy, et al., 1979 | DH |
180.47 | 298.15 | Jolicoeur, Boileau, et al., 1975 | DH |
180.75 | 298.15 | Finke, Scott, et al., 1956 | T = 12 to 300 K.; DH |

Reaction thermochemistry data

Data compiled as indicated in comments:
ALS - Hussein Y. Afeefy, Joel F. Liebman, and Stephen E. Stein
B - John E. Bartmess
Individual Reactions
By formula: H2 + C7H12 = C7H14
Quantity | Value | Units | Method | Reference | Comment |
---|---|---|---|---|---|
ΔrH° | -110. ± 0.4 | kJ/mol | Chyd | Roth and Lennartz, 1980 | liquid phase; solvent: Cyclohexane; ALS |
ΔrH° | -108.2 ± 0.4 | kJ/mol | Chyd | Turner, Meador, et al., 1957 | liquid phase; solvent: Acetic acid; ALS |
ΔrH° | -108.9 ± 0.63 | kJ/mol | Chyd | Conn, Kistiakowsky, et al., 1939 | gas phase; Reanalyzed by Cox and Pilcher, 1970, Original value = -111.0 ± 0.08 kJ/mol; At 355 K; ALS |
By formula: 3H2 + C7H8 = C7H14
Quantity | Value | Units | Method | Reference | Comment |
---|---|---|---|---|---|
ΔrH° | -305. ± 0.4 | kJ/mol | Chyd | Roth, Klaerner, et al., 1983 | liquid phase; solvent: Isooctane; ALS |
ΔrH° | -294.9 ± 1.6 | kJ/mol | Chyd | Turner, Meador, et al., 1957 | liquid phase; solvent: Acetic acid; ALS |
ΔrH° | -301.7 ± 1.3 | kJ/mol | Chyd | Conn, Kistiakowsky, et al., 1939 | gas phase; Reanalyzed by Cox and Pilcher, 1970, Original value = -304.8 ± 0.04 kJ/mol; at 355 K; ALS |
By formula: 2H2 + C7H10 = C7H14
Quantity | Value | Units | Method | Reference | Comment |
---|---|---|---|---|---|
ΔrH° | -208.9 ± 0.3 | kJ/mol | Chyd | Turner, Mallon, et al., 1973 | liquid phase; solvent: Glacial acetic acid; ALS |
ΔrH° | -212.4 ± 0.63 | kJ/mol | Chyd | Conn, Kistiakowsky, et al., 1939 | gas phase; Reanalyzed by Cox and Pilcher, 1970, Original value = -214.5 ± 0.2 kJ/mol; At 355 K; ALS |
C7H13- + =
By formula: C7H13- + H+ = C7H14
Quantity | Value | Units | Method | Reference | Comment |
---|---|---|---|---|---|
ΔrH° | 1739. ± 20. | kJ/mol | Bran | Peerboom, Rademaker, et al., 1992 | gas phase; B |
Quantity | Value | Units | Method | Reference | Comment |
ΔrG° | 1702. ± 21. | kJ/mol | H-TS | Peerboom, Rademaker, et al., 1992 | gas phase; B |
By formula: 2H2 + C7H10 = C7H14
Quantity | Value | Units | Method | Reference | Comment |
---|---|---|---|---|---|
ΔrH° | -234. ± 3. | kJ/mol | Chyd | Turner, Mallon, et al., 1973 | liquid phase; solvent: Glacial acetic acid; ALS |

Gas phase ion energetics data

Data evaluated as indicated in comments:
L - Sharon G. Lias
Data compiled as indicated in comments:
B - John E. Bartmess
LL - Sharon G. Lias and Joel F. Liebman
LBLHLM - Sharon G. Lias, John E. Bartmess, Joel F. Liebman, John L. Holmes, Rhoda D. Levin, and W. Gary Mallard
LLK - Sharon G. Lias, Rhoda D. Levin, and Sherif A. Kafafi
Quantity | Value | Units | Method | Reference | Comment |
---|---|---|---|---|---|
IE (evaluated) | 9.9 ± 0.1 | eV | N/A | N/A | L |
Ionization energy determinations
IE (eV) | Method | Reference | Comment |
---|---|---|---|
9.82 ± 0.05 | EI | Holmes and Lossing, 1991 | LL |
9.96 | EQ | Sieck and Mautner(Meot-Ner), 1982 | LBLHLM |
9.97 | PE | Puttemans, 1974 | LLK |
9.88 ± 0.05 | EI | Puttemans, 1974 | LLK |
De-protonation reactions
C7H13- + =
By formula: C7H13- + H+ = C7H14
Quantity | Value | Units | Method | Reference | Comment |
---|---|---|---|---|---|
ΔrH° | 1739. ± 20. | kJ/mol | Bran | Peerboom, Rademaker, et al., 1992 | gas phase; B |
Quantity | Value | Units | Method | Reference | Comment |
ΔrG° | 1702. ± 21. | kJ/mol | H-TS | Peerboom, Rademaker, et al., 1992 | gas phase; B |

Henry's Law data

Data compiled by: Rolf Sander
Henry's Law constant (water solution)
kH(T) = k°H exp(d(ln(kH))/d(1/T) ((1/T) - 1/(298.15 K)))
k°H = Henry's law constant for solubility in water at 298.15 K (mol/(kg*bar))
d(ln(kH))/d(1/T) = Temperature dependence constant (K)
k°H (mol/(kg*bar)) | d(ln(kH))/d(1/T) (K) | Method | Reference | Comment |
---|---|---|---|---|
0.16 | Q | N/A | Several references are given in the list of Henry's law constants but not assigned to specific species. | |
0.011 | Q | N/A | missing citation give several references for the Henry's law constants but don't assign them to specific species. |

References

Finke H.L., 1956
Finke H.L.,
Cycloheptane, cyclooctane, and 1,3,5-cycloheptatriene. Low-temperature thermal properties, vapor pressure, and derived chemical thermodynamic properties,
J. Am. Chem. Soc., 1956, 78, 5469-5476. [all data]
Dorofeeva O.V., 1986
Dorofeeva O.V.,
Thermodynamic properties of twenty-one monocyclic hydrocarbons,
J. Phys. Chem. Ref. Data, 1986, 15, 437-464. [all data]
Chang S., 1970
Chang S.,
The heats of combustion and strain energies of bicyclo[n.m.0]alkanes,
J. Am. Chem. Soc., 1970, 92, 3109-3118. [all data]
Finke, Scott, et al., 1956
Finke, H.L.; Scott, D.W.; Gross, M.E.; Messerly, J.F.; Waddington, G.,
Cycloheptane, Cyclooctane and 1,3,5-Cycloheptatriene. Low Temperature Thermal Properties, Vapor Pressure and Derived Chemical Thermodynamic Prop.,
J. Am. Chem. Soc., 1956, 78, 5469. [all data]
Kaarsemaker, 1951
Kaarsemaker, S.,
, Thesis, 1951. [all data]
Daubert, 1996
Daubert, T.E.,
Vapor-Liquid Critical Properties of Elements and Compounds. 5. Branched Alkanes and Cycloalkanes,
J. Chem. Eng. Data, 1996, 41, 365-372. [all data]
Hicks and Young, 1971
Hicks, C.P.; Young, C.L.,
Critical Temperatures of Mixtures of Quasi-spherical Molecules. Alicyclic Hydrocarbons + Benzene, + Hexafluorobenzene and + Perfluorocyclohexane,
Trans. Faraday Soc., 1971, 67, 1605-11. [all data]
Young, 1972
Young, C.L.,
Gas-liquid critical properties of the cycloalkanes and their mixtures,
Aust. J. Chem., 1972, 25, 1625-30. [all data]
Anand, Grolier, et al., 1975
Anand, Subhash C.; Grolier, Jean P.E.; Kiyohara, Osamu; Halpin, Carl J.; Benson, George C.,
Thermodynamic properties of some cycloalkane-cycloalkanol systems at 298. 15K. III,
J. Chem. Eng. Data, 1975, 20, 2, 184-189, https://doi.org/10.1021/je60065a020
. [all data]
Finke, Scott, et al., 1956, 2
Finke, H.L.; Scott, D.W.; Gross, M.E.; Messerly, J.F.; Waddington, G.,
Cycloheptane, cyclooctane and 1,3,5-cycloheptatriene. Low temperature thermal properties, vapor pressure and derived chemical thermodynamic properties,
J. Am. Chem. Soc., 1956, 78, 5469-54. [all data]
Finke, Scott, et al., 1956, 3
Finke, H.L.; Scott, D.W.; Gross, M.E.; Messerly, J.F.; Waddington, G.,
Cycloheptane, cyclooctane and 1,3,5-cycloheptatriene. Low temperature thermal properties, vapor pressure and derived chemical thermodynamic properties,
J. Am. Chem. Soc., 1956, 78, 5469-5476. [all data]
Kaarsemaker and Coops, 1952
Kaarsemaker, S.; Coops, J.,
Thermal quantities of some cycloparaffins. Part III. Results of measurements,
Rec. Trav. Chim. Pays/Bas, 1952, 71, 261. [all data]
Spitzer and Huffman, 1947
Spitzer, R.; Huffman, H.M.,
The heats of combustion of cyclopentane, cyclohexane, cycloheptane and cyclooctane,
J. Am. Chem. Soc., 1947, 69, 211-213. [all data]
Stephenson and Malanowski, 1987
Stephenson, Richard M.; Malanowski, Stanislaw,
Handbook of the Thermodynamics of Organic Compounds, 1987, https://doi.org/10.1007/978-94-009-3173-2
. [all data]
Meyer and Hotz, 1976
Meyer, Edwin F.; Hotz, Carol A.,
Cohesive energies in polar organic liquids. 3. Cyclic ketones,
J. Chem. Eng. Data, 1976, 21, 3, 274-279, https://doi.org/10.1021/je60070a035
. [all data]
Bondi, 1963
Bondi, A.,
Heat of Siblimation of Molecular Crystals: A Catalog of Molecular Structure Increments.,
J. Chem. Eng. Data, 1963, 8, 3, 371-381, https://doi.org/10.1021/je60018a027
. [all data]
Domalski and Hearing, 1996
Domalski, Eugene S.; Hearing, Elizabeth D.,
Heat Capacities and Entropies of Organic Compounds in the Condensed Phase. Volume III,
J. Phys. Chem. Ref. Data, 1996, 25, 1, 1, https://doi.org/10.1063/1.555985
. [all data]
Haines and Gilson, 1990
Haines, J.; Gilson, D.F.R.,
Investigation of the phase transition behavior in solid cycloheptane,
J. Phys. Chem., 1990, 94, 3156-3160. [all data]
Dallos, Sisak, et al., 2000
Dallos, A.; Sisak, A.; Kulcsár, Z.; Kováts, E.,
Pair-wise interactions by gas chromatography VII. Interaction free enthalpies of solutes with secondary alcohol groups,
J. Chromatogr. A, 2000, 904, 2, 211-242, https://doi.org/10.1016/S0021-9673(00)00908-0
. [all data]
Reddy, Dutoit, et al., 1992
Reddy, K.S.; Dutoit, J.-Cl.; Kovats, E. sz.,
Pair-wise interactions by gas chromatography. I. Interaction free enthalpies of solutes with non-associated primary alcohol groups,
J. Chromatogr., 1992, 609, 1-2, 229-259, https://doi.org/10.1016/0021-9673(92)80167-S
. [all data]
Dutoit, 1991
Dutoit, J.,
Gas chromatographic retention behaviour of some solutes on structurally similar polar and non-polar stationary phases,
J. Chromatogr., 1991, 555, 1-2, 191-204, https://doi.org/10.1016/S0021-9673(01)87179-X
. [all data]
Lunskii and Paizanskaya, 1988
Lunskii, M.Kh.; Paizanskaya, I.L.,
Identification of hydrocarbons C1-C9 of petrol fractions of oils and condensates in the use of capillary columns with dinonylphthalate,
Zh. Anal. Khim., 1988, 43, 127-135. [all data]
Engewald, Billing, et al., 1987
Engewald, W.; Billing, U.; Welsch, T.; Haufe, G.,
Structure-retention correlations of hydrocarbons in gas-liquid and gas-solid chromatography. Cycloalkenes and cycloalkadienes,
Chromatographia, 1987, 23, 8, 590-594, https://doi.org/10.1007/BF02324870
. [all data]
Bredael, 1982
Bredael, P.,
Retention indices of hydrocarbons on SE-30,
J. Hi. Res. Chromatogr. Chromatogr. Comm., 1982, 5, 6, 325-328, https://doi.org/10.1002/jhrc.1240050610
. [all data]
Johansen and Ettre, 1982
Johansen, N.G.; Ettre, L.S.,
Retention index values of hydrocarbons on open-tubular columns coated with methylsilicone liquid phases,
Chromatographia, 1982, 15, 10, 625-630, https://doi.org/10.1007/BF02279488
. [all data]
Nabivach and Kirilenko, 1980
Nabivach, V.M.; Kirilenko, A.V.,
Relationship between the gas chromatographic behaviour and the molecular structure of hydrocarbon samples and various stationary phases. Part II. Correlation between the retention index, physicochemical properties and molecular structure,
Chromatographia, 1980, 13, 2, 93-100, https://doi.org/10.1007/BF02263060
. [all data]
Riedo, Fritz, et al., 1976
Riedo, F.; Fritz, D.; Tarján, G.; Kováts, E.Sz.,
A tailor-made C87 hydrocarbon as a possible non-polar standard stationary phase for gas chromatography,
J. Chromatogr., 1976, 126, 63-83, https://doi.org/10.1016/S0021-9673(01)84063-2
. [all data]
Engewald, Epsch, et al., 1974
Engewald, W.; Epsch, K.; Graefe, J.; Welsch, Th.,
Molekülstruktur und retentionsverhalten. II. Retentionsverhalten cycloaliphatischer kohlenwasser-stoffe bei der gas-adsorptions- und gas-verteilungschromatographie,
J. Chromatogr., 1974, 91, 623-631, https://doi.org/10.1016/S0021-9673(01)97943-9
. [all data]
Besson and Gäumann, 1973
Besson, R.; Gäumann, T.,
Indices de rétention de cycloalcanes, cycloalcènes, bicycloalkyles, cycloalkyl-cycloalcényles et bicycloalcényles en chromatographie en phase gazeuse,
Helv. Chim. Acta, 1973, 56, 3, 1159-1164, https://doi.org/10.1002/hlca.19730560339
. [all data]
Agrawal, Tesarík, et al., 1972
Agrawal, B.B.; Tesarík, K.; Janák, J.,
Gas chromatographic characterization of sulphur compounds in the 93-162° gasoline cut from Romashkino crude oil using Kováts retention indices,
J. Chromatogr., 1972, 65, 1, 207-215, https://doi.org/10.1016/S0021-9673(00)86933-2
. [all data]
Robinson and Odell, 1971
Robinson, P.G.; Odell, A.L.,
A system of standard retention indices and its uses. The characterisation of stationary phases and the prediction of retention indices,
J. Chromatogr., 1971, 57, 1-10, https://doi.org/10.1016/0021-9673(71)80001-8
. [all data]
Hively and Hinton, 1968
Hively, R.A.; Hinton, R.E.,
Variation of the retention index with temperature on squalane substrates,
J. Gas Chromatogr., 1968, 6, 4, 203-217, https://doi.org/10.1093/chromsci/6.4.203
. [all data]
Schomburg, 1966
Schomburg, G.,
Gaschromatographische Retentionsdaten und struktur chemischer verbindungen. III. Alkylverzweigte und ungesättigte cyclische Kohlenwasserstoffe,
J. Chromatogr., 1966, 23, 18-41, https://doi.org/10.1016/S0021-9673(01)98653-4
. [all data]
Schomburg, 1964
Schomburg, G.,
Gas-Chromatographische Retentionsdaten und Struktur Chemischer Verbindungen. I. Verzweigte Aliphatische und Alicyclische Carbonsäure-Methylester,
J. Chromatogr., 1964, 14, 157-177, https://doi.org/10.1016/S0021-9673(00)86608-X
. [all data]
Louis, 1971
Louis, R.,
Kovats-index-tafeln zur gaschromatographischen analyse von kohlenwasserstoffgemischen,
Erdoel Kohle Erdgas Petrochem., 1971, 24, 2, 88-94. [all data]
White, Hackett, et al., 1992
White, C.M.; Hackett, J.; Anderson, R.R.; Kail, S.; Spock, P.S.,
Linear temperature programmed retention indices of gasoline range hydrocarbons and chlorinated hydrocarbons on cross-linked polydimethylsiloxane,
J. Hi. Res. Chromatogr., 1992, 15, 2, 105-120, https://doi.org/10.1002/jhrc.1240150211
. [all data]
Buchman, Cao, et al., 1984
Buchman, O.; Cao, G.-Y.; Peng, C.T.,
Structure assignment by retention index in gas-liquid radiochromatography of substituted cyclohexenes,
J. Chromatogr., 1984, 312, 75-90, https://doi.org/10.1016/S0021-9673(01)92765-7
. [all data]
Peng, 2000
Peng, C.T.,
Prediction of retention indices. V. Influence of electronic effects and column polarity on retention index,
J. Chromatogr. A, 2000, 903, 1-2, 117-143, https://doi.org/10.1016/S0021-9673(00)00901-8
. [all data]
Peng, Ding, et al., 1988
Peng, C.T.; Ding, S.F.; Hua, R.L.; Yang, Z.C.,
Prediction of Retention Indexes I. Structure-Retention Index Relationship on Apolar Columns,
J. Chromatogr., 1988, 436, 137-172, https://doi.org/10.1016/S0021-9673(00)94575-8
. [all data]
Supelco, 2012
Supelco, CatalogNo. 24160-U,
Petrocol DH Columns. Catalog No. 24160-U, 2012, retrieved from http://www.sigmaaldrich.com/etc/medialib/docs/Supelco/Datasheet/1/w97949.Par.0001.File.tmp/w97949.pdf. [all data]
Chen, 2008
Chen, H.-F.,
Quantitative prediction of gas chromatography retention indices with support vector machines, radial basis neutral networks and multiple linear regression,
Anal. Chim. Acta, 2008, 609, 1, 24-36, https://doi.org/10.1016/j.aca.2008.01.003
. [all data]
Zenkevich and Marinichev, 2001
Zenkevich, I.G.; Marinichev, A.N.,
Comparison of Topological and Dynamics Molecular Characteristics for Precalculation of Chromatographic Retention Parameters of Organic Compounds (in Russian),
Zh. Struct. Khim., 2001, 42, 5, 893-902. [all data]
Waggott and Davies, 1984
Waggott, A.; Davies, I.W.,
Identification of organic pollutants using linear temperature programmed retention indices (LTPRIs) - Part II, 1984, retrieved from http://dwi.defra.gov.uk/research/completed-research/reports/dwi0383.pdf. [all data]
Robinson and Odell, 1971, 2
Robinson, P.G.; Odell, A.L.,
Comparison of isothermal and non-linear temperature programmed gas chromatography. The temperature dependence of the retention indices of a number of hydrocarbons on squalane and SE-30,
J. Chromatogr., 1971, 57, 11-17, https://doi.org/10.1016/0021-9673(71)80002-X
. [all data]
Peng, Yang, et al., 1991
Peng, C.T.; Yang, Z.C.; Ding, S.F.,
Prediction of rentention idexes. II. Structure-retention index relationship on polar columns,
J. Chromatogr., 1991, 586, 1, 85-112, https://doi.org/10.1016/0021-9673(91)80028-F
. [all data]